program: Gaussian 09
title: 000194343
version: EM64L-G09RevD.01
frameworkgroup: C1[X(C16H22N4O7S)]
method: RPBEPBE
basis: SDD
operation: Freq
keyword: #p
keyword: freq=noraman
keyword: PBEPBE/SDD
title: #p freq=noraman PBEPBE/SDD
converged: YES YES NO NO
title: Mulliken charges:
elementType: S O O O O O O O N N N N C C C C C C C C C C C C C C C C H H H H H H H H H H H H H H H H H H H H H H
charge: 0.726622 -0.312735 -0.285318 -0.635736 -0.387184 -0.336451 -0.399253 -0.237907 -0.363274 -0.360315 -0.658034 -0.637859 -0.141824 -0.755571 -0.474744 -0.538628 -0.187921 0.241759 0.253285 0.260373 -0.444238 0.380175 -0.372168 -0.349044 0.207828 -0.207245 -0.201678 -0.243348 0.301124 0.324577 0.301941 0.240498 0.296899 0.223510 0.250684 0.373222 0.264402 0.372620 0.354115 0.352783 0.296066 0.262378 0.284031 0.259566 0.247928 0.382627 0.227763 0.229802 0.231178 0.382721
chargesum: 0.00000
title: Mulliken charges with hydrogens summed into heavy atoms:
elementType: S O O O O O O O N N N N C C C C C C C C C C C C C C C C
charge: 0.726622 -0.312735 -0.285318 -0.635736 -0.004558 -0.336451 -0.016532 -0.237907 0.009948 0.012305 -0.303919 0.010990 0.159299 -0.129053 0.062653 -0.064434 0.076481 0.241759 0.253285 0.260373 0.102171 0.380175 -0.112602 -0.101116 0.207828 0.020519 0.028124 -0.012170
polarizability: 3.66224515e+02 -1.40864136e+01 2.46105579e+02 -1.05176327e+00 -9.59189496e+00 1.71957990e+02
1716.lowfreq: -13.4507 -4.7583 -0.0006 0.0005 0.0010 3.4482 19.8011 20.0372 28.6707
frequency: 19.3425 19.9464 28.6218 30.7334 31.8926 36.3971 55.0092 58.0982 61.2843 65.4642 75.5311 85.5807 98.2722 104.3778 115.5358 130.5434 158.4823 163.3177 168.3650 189.5049 204.9401 212.2478 252.3348 261.3174 273.9182 276.4331 280.8914 290.5271 299.8889 331.9974 343.7442 357.8804 406.5324 408.1829 425.0196 441.3052 449.8492 480.6011 484.4125 509.1286 519.5590 560.2518 570.8742 579.9504 602.7737 612.1812 613.5451 633.0798 659.6258 666.0889 673.2324 695.1056 709.5696 713.4785 738.6027 748.1490 762.1394 768.1968 789.3559 812.1416 813.4579 832.4408 838.9223 873.4283 879.9091 884.6508 909.6755 917.0571 933.8886 969.0838 972.1972 986.8050 989.0597 991.8006 1015.7366 1022.6217 1027.3704 1043.9112 1073.2055 1076.9792 1080.6975 1090.4635 1105.2613 1123.4684 1151.4692 1160.4994 1170.7574 1176.8590 1183.4997 1209.4580 1227.6892 1240.6917 1248.9984 1261.6809 1274.6120 1278.9158 1283.9730 1288.2029 1311.0863 1314.2613 1329.8773 1331.7837 1337.8369 1348.3482 1381.3004 1394.7787 1399.3598 1430.1277 1437.9104 1450.6073 1466.4652 1474.4960 1479.0275 1536.8575 1564.9014 1586.6312 1589.5354 1603.6660 1603.9272 1625.7468 1634.0887 1658.5172 2961.7834 2997.0590 2999.5558 3006.9156 3045.2993 3056.3945 3064.6972 3069.2529 3102.8525 3119.0107 3130.7338 3136.5733 3141.1262 3153.8453 3157.1099 3168.2631 3300.0631 3337.0370 3398.0631 3489.1324 3515.6483 3636.7164
redmass: 5.8816 7.2975 9.5039 4.3884 5.7104 6.4397 6.0746 8.0065 4.6494 7.5068 5.8090 5.6685 5.0166 7.1604 10.1357 5.0651 4.8819 5.5070 6.9633 6.6583 3.9773 3.7029 3.7603 1.7823 5.0633 3.9890 2.9255 6.0723 5.1433 8.4681 5.8367 4.5916 2.9394 3.8582 2.9839 3.0288 3.3710 2.2938 3.6763 4.6538 3.8841 4.8467 3.9246 3.8045 3.2829 4.0459 4.1131 1.4523 1.7549 3.4787 1.2762 1.8494 3.9086 3.9511 2.5306 1.4585 5.0303 1.7308 7.4424 5.1315 4.4468 1.7108 1.3571 2.4833 1.8580 1.7599 1.3791 1.4613 2.5200 1.8742 1.7596 4.2674 2.4005 1.3830 2.6680 2.1365 2.3608 3.1824 2.2521 2.5414 1.5770 2.3928 2.3638 2.4808 1.5606 1.4671 1.0635 1.4252 1.1248 1.2664 3.5608 1.5465 1.4830 1.2229 1.4155 1.4404 1.9114 1.2852 2.2519 2.3815 1.5222 1.5159 1.3008 1.3953 1.5057 3.6408 1.2652 1.0851 1.1250 2.0393 1.0828 1.1035 2.1641 2.2163 1.6527 3.7442 3.5623 5.6129 3.0760 1.7872 2.6783 8.9996 1.0820 1.0641 1.0606 1.0654 1.0896 1.0586 1.0998 1.0991 1.0967 1.0883 1.0867 1.1064 1.0924 1.0956 1.0889 1.1014 1.0769 1.0824 1.0561 1.0639 1.0639 1.0929
irintensity: 0.3356 0.0749 1.0271 0.4158 0.9091 1.1838 2.0391 1.8332 0.8406 1.2023 5.1193 3.1158 3.8969 2.9994 1.3779 6.5192 4.5011 20.5334 1.3833 11.0022 17.2167 1.0303 20.0999 33.5601 20.2397 8.4167 21.9696 0.6068 14.5610 13.7469 19.9987 21.1710 2.2754 19.2198 10.5229 33.2195 2.1961 15.2650 11.6244 63.5948 3.7908 2.6569 2.2933 41.2229 15.3946 16.9693 24.0665 61.8311 99.0067 38.3139 225.4455 19.3664 10.4799 46.6975 6.7558 69.3254 4.1701 50.9495 95.6177 14.0377 4.1086 42.1436 0.3530 13.4506 30.1797 56.4619 132.8763 2.5567 6.7520 7.7852 4.0154 1.1742 14.7058 0.7117 10.6691 5.4009 10.3493 160.2374 86.9647 132.8491 18.3781 42.5667 93.7654 0.2426 11.6415 6.4704 0.1946 12.2771 1.4679 6.4809 26.8190 8.0585 47.7917 29.0382 9.6269 1.2332 29.2056 2.4671 42.8757 45.5716 7.9161 8.9044 5.0752 4.3112 20.2081 3.7057 5.8593 23.3149 27.1084 34.2552 16.4363 11.4464 36.5966 311.7744 396.3821 90.3995 115.1329 14.7746 63.7137 63.6500 231.8572 346.0408 7.5786 26.3443 56.4443 19.5642 10.9149 3.4189 4.8606 14.2608 15.5943 2.6382 1.4903 4.5462 10.9370 24.1635 538.0447 26.5526 81.2031 322.8231 122.4589 28.3854 26.6277 48.2093
temp: 298.150 k
press: 1.00000 atm
elementType: 16 8 8 8 8 8 8 8 7 7 7 7 6 6 6 6 6 6 6 6 6 6 6 6 6 6 6 6 1 1 1 1 1 1 1 1 1 1 1 1 1 1 1 1 1 1 1 1 1 1
symmnumber: 1
zpe: 1004881.2 jmol-1
zpe.correction: 0.382739 hartree
zpe.thermalcorrener: 0.412397 hartree
zpe.thermalcorrenthalpy: 0.413341 hartree
zpe.thermalcorrgfe: 0.317952 hartree
zpe.sumelectzpe: -1764.380418 hartree
zpe.sumelectthermal: -1764.350760 hartree
zpe.sumelectthermalent: -1764.349816 hartree
zpe.sumelectthermalfe: -1764.445205 hartree
dipole: 6.5581 3.1583 -0.0192
dipole: 7.2790
quadrupole: -185.3631 -157.8413 -171.0401
quadrupole: 1.5195 6.2090 10.6866
quadrupole: -13.9482 13.5735 0.3747 1.5195 6.2090 10.6866
hfenergy: -1764.763157 hartree
pointgroup: C01 [X(C16H22N4O7S1)]
dipole: 2.8175564 0.5121737 0.0135088 debye
polarizability: 350.5225741|-42.6277005|259.9695207|3.2407062|-16.2858593|173.7959885 unknown
InChI: InChI=1S/C16H22N4O7S/c17-11(16(25)26)6-7-13(21)19-12(15(24)18-8-14(22)23)9-28(27)20-10-4-2-1-3-5-10/h1-5,11-12,18-20,22,25H,6-9,17H2
charge 0 multiplicity 1
50 atoms
S  0.485401 -1.723847 -0.632961
O  -2.371797 2.60235 -1.09367
O  -3.593109 -1.062359 1.400368
O  0.764324 -0.419595 -1.643032
O  3.342776 2.774901 1.56791
O  1.618826 1.26235 1.334763
O  -5.961023 0.020268 -1.473461
O  -7.710046 0.952835 -0.261598
N  -1.084505 1.227144 0.281436
N  -4.066215 0.925997 0.270301
N  1.73558 -1.736788 0.808707
N  3.153316 1.477875 -1.297052
C  -1.808964 -0.032946 0.005884
C  -0.999432 -1.21809 0.53079
C  1.006638 2.787741 -1.314454
C  -0.134146 3.377682 -0.414895
C  2.402685 2.571041 -0.659662
C  -1.305897 2.392293 -0.415011
C  -3.241266 -0.104011 0.641358
C  2.362514 2.146683 0.815522
C  -5.451128 0.974327 0.713101
C  2.979512 -2.388452 0.52673
C  4.182096 -1.649097 0.351931
C  3.011037 -3.807765 0.465516
C  -6.496021 0.671732 -0.360809
C  5.403741 -2.329975 0.15779
C  4.231292 -4.477109 0.240301
C  5.433825 -3.742904 0.095064
H  -1.94696 -0.105985 -1.094767
H  -1.623246 -2.122221 0.592297
H  -0.545217 -1.039549 1.517787
H  1.156912 3.432769 -2.197825
H  0.683811 1.800241 -1.692205
H  0.214399 3.560377 0.619576
H  -0.504938 4.334751 -0.81223
H  -0.171084 1.141323 0.756595
H  3.000369 3.497926 -0.698433
H  -3.678744 1.640594 -0.384978
H  1.839417 -0.743971 1.104385
H  2.576305 0.690989 -1.625928
H  3.971462 1.722316 -1.85107
H  -5.707075 1.961279 1.138164
H  -5.57624 0.220447 1.514961
H  4.147599 -0.552347 0.342145
H  2.082429 -4.367348 0.620887
H  3.368597 2.392241 2.488506
H  6.329555 -1.756476 0.035543
H  4.249167 -5.571712 0.195722
H  6.381936 -4.267114 -0.066635
H  -6.69367 -0.168513 -2.121157
