program: Gaussian 09
title: 000194331
version: EM64L-G09RevD.01
frameworkgroup: C1[X(C14H13NO)]
method: RPBEPBE
basis: SDD
operation: Freq
keyword: #p
keyword: freq=noraman
keyword: PBEPBE/SDD
title: #p freq=noraman PBEPBE/SDD
converged: NO NO NO NO
title: Mulliken charges:
elementType: O N C C C C C C C C C C C C C C H H H H H H H H H H H H H
charge: -0.439684 -0.471913 0.069548 0.020429 0.201886 0.182705 0.375941 0.348088 -0.530942 -0.482281 -0.355974 -0.350964 -0.852489 -0.801433 0.255013 -0.346274 0.297965 0.232321 0.224103 0.222408 0.233436 0.229572 0.229564 0.233362 0.197985 0.239728 0.239795 0.248659 0.349444
chargesum: 0.00000
title: Mulliken charges with hydrogens summed into heavy atoms:
elementType: O N C C C C C C C C C C C C C C
charge: -0.090240 -0.173948 0.069548 0.020429 0.201886 0.182705 0.375941 0.348088 -0.298621 -0.258178 -0.133566 -0.117528 -0.159991 -0.123924 0.255013 -0.097615
polarizability: 2.56386300e+02 7.18932803e+00 1.81639551e+02 1.31997410e-03 -5.29447573e-03 7.29073726e+01
1716.lowfreq: -145.7121 -2.0525 -0.0005 0.0004 0.0007 1.6755 8.0243 71.8646 116.6105
frequency: -145.7117 71.8513 116.6034 128.6547 155.0222 195.8623 214.4066 259.5700 291.5227 299.5096 310.4296 326.8096 378.8290 387.0031 422.9825 428.1344 455.4149 456.3574 531.1809 546.8836 557.9021 584.1713 607.4857 616.4224 683.1333 730.9587 737.5839 780.4999 801.6237 807.1144 810.0253 832.7273 846.0382 930.2378 931.6825 935.6136 956.6661 999.1134 1035.4214 1039.1192 1043.8508 1104.8016 1113.8309 1138.9787 1170.1113 1206.0237 1222.7140 1254.2249 1261.3258 1288.6540 1316.7173 1344.4483 1370.1683 1396.2634 1403.5252 1414.9636 1432.8742 1464.4748 1467.8541 1472.5727 1473.0916 1478.3364 1487.9682 1520.2928 1597.4244 1601.6865 1623.4227 1635.2032 2963.6673 2975.5243 3036.9263 3053.8659 3069.4788 3078.8185 3112.5043 3135.3146 3138.0149 3138.5089 3172.3831 3595.4437 3618.8526
redmass: 1.0191 4.9513 3.6813 2.9710 4.3453 3.6890 1.1535 2.9369 3.6480 4.6945 1.1169 3.5140 6.2706 5.1388 4.2448 2.6243 5.3179 1.1855 5.2204 3.1928 3.5280 3.7484 6.2329 3.6853 6.5762 4.9690 4.3391 4.1210 6.4958 1.5351 1.2432 5.2638 1.6897 1.3365 1.3311 2.2011 2.5313 1.8380 1.4958 2.2569 1.5356 1.8229 1.4766 1.4159 2.0258 1.8357 1.8472 2.2225 1.7266 2.5424 3.0860 2.4866 3.4875 1.2935 1.3054 4.4988 3.8415 2.8643 1.0443 2.3285 1.0466 1.2619 1.3160 3.7916 7.8937 6.4932 6.3191 7.9059 1.0378 1.0371 1.0974 1.0982 1.0977 1.0974 1.0871 1.0898 1.0910 1.0955 1.0953 1.0660 1.0796
irintensity: 0.4305 0.4309 0.1003 2.0224 0.3357 0.1664 1.0761 0.1632 6.0561 5.3287 137.3149 1.3571 0.0000 8.2509 5.3770 2.4806 3.6758 94.7638 4.7560 30.4683 5.0300 1.5541 4.2561 2.8216 2.3321 3.0909 0.7134 0.0073 23.4173 40.0315 49.4670 0.2248 22.6428 0.1247 0.1170 6.6349 8.7364 2.6313 5.6479 11.6600 9.6433 5.9205 112.7611 197.8594 3.3058 9.9434 41.1662 2.0093 2.3913 10.8840 2.5229 64.6675 13.7807 16.4102 6.0762 11.0687 9.9817 131.4222 10.9770 32.0627 14.3428 31.8928 42.5237 29.3898 10.7931 24.8861 6.2577 18.8695 33.0330 44.6965 21.7587 19.0608 26.7093 29.0365 13.7229 16.4718 11.0743 32.6683 8.4504 34.2405 42.7514
temp: 298.150 k
press: 1.00000 atm
elementType: 8 7 6 6 6 6 6 6 6 6 6 6 6 6 6 6 1 1 1 1 1 1 1 1 1 1 1 1 1
symmnumber: 1
zpe: 607677.1 jmol-1
zpe.correction: 0.231452 hartree
zpe.thermalcorrener: 0.244466 hartree
zpe.thermalcorrenthalpy: 0.245410 hartree
zpe.thermalcorrgfe: 0.192948 hartree
zpe.sumelectzpe: -670.177388 hartree
zpe.sumelectthermal: -670.164374 hartree
zpe.sumelectthermalent: -670.163429 hartree
zpe.sumelectthermalfe: -670.215892 hartree
dipole: 1.7730 -0.5010 0.0002
dipole: 1.8424
quadrupole: -94.4888 -73.4553 -100.2057
quadrupole: -7.8945 0.0013 -0.0010
quadrupole: -5.1056 15.9280 -10.8224 -7.8945 0.0013 -0.0010
hfenergy: -670.4088398 hartree
pointgroup: C01 [X(C14H13N1O1)]
dipole: -0.6850366 0.2369718 -0.0000117 debye
polarizability: 256.9651459|2.8432423|181.0606957|0.0352217|0.0199439|72.9073825 unknown
InChI: InChI=1S/C14H13NO/c1-8-3-4-9(2)14-13(8)11-7-10(16)5-6-12(11)15-14/h3-7,15-16H,1-2H3
charge 0 multiplicity 1
29 atoms
O  4.437213 -1.062554 0.000643
N  -0.37514 1.788589 0.000188
C  -0.64693 -0.503154 -0.000215
C  -1.334961 0.763314 -0.000206
C  0.783854 -0.205719 0.000107
C  0.913429 1.226405 0.000343
C  -1.394336 -1.715111 -0.000475
C  -2.747259 0.876404 -0.000528
C  1.960647 -1.000219 0.000197
C  -2.80311 -1.605643 -0.000758
C  -3.458893 -0.344211 -0.000811
C  2.17077 1.866281 0.000704
C  -0.714512 -3.07039 -0.000467
C  -3.466544 2.21544 -0.000396
C  3.216466 -0.355157 0.000539
C  3.32687 1.062673 0.000801
H  -0.576349 2.785063 0.000236
H  1.901794 -2.094526 -0.000026
H  -3.408281 -2.519901 -0.000975
H  -4.55608 -0.315374 -0.001097
H  2.257322 2.958359 0.000898
H  -0.070509 -3.201159 -0.892066
H  -0.070263 -3.201033 0.890965
H  -1.455618 -3.888206 -0.000307
H  -2.774038 3.076312 -0.003168
H  -4.117095 2.3212 -0.88887
H  -4.112832 2.323418 0.890944
H  4.327517 1.504658 0.001071
H  4.275271 -2.037357 0.000431
