program: Gaussian 09
title: 000194312
version: EM64L-G09RevD.01
frameworkgroup: C1[X(C8H15NO5)]
method: RPBEPBE
basis: SDD
operation: Freq
keyword: #p
keyword: freq=noraman
keyword: PBEPBE/SDD
title: #p freq=noraman PBEPBE/SDD
converged: NO YES NO NO
title: Mulliken charges:
elementType: O O O O O N C C C C C C C C H H H H H H H H H H H H H H H
charge: -0.246910 -0.298442 -0.411786 -0.198010 -0.211666 0.096065 0.274522 -0.080944 -0.478386 -0.084630 -0.060937 -0.738295 -0.687309 -0.528415 0.254794 0.253478 0.232765 0.217519 0.226874 0.206006 0.260485 0.269311 0.249588 0.236040 0.210071 0.351201 0.207032 0.241840 0.238140
chargesum: 0.00000
title: Mulliken charges with hydrogens summed into heavy atoms:
elementType: O O O O O N C C C C C C C C
charge: -0.246910 -0.298442 -0.060585 -0.198010 -0.211666 0.096065 0.274522 0.173850 0.007856 0.132889 0.165937 -0.002492 0.008390 0.158597
polarizability: 1.18098971e+02 2.91844819e+00 1.14306080e+02 -1.87721828e+00 -4.94410002e+00 9.95099886e+01
1716.lowfreq: -8.3528 -3.7358 0.0007 0.0010 0.0010 9.3785 16.9474 54.9495 77.9184
frequency: 16.7270 54.9278 77.8436 109.3069 141.4584 149.6106 150.9999 163.5758 188.8174 218.1509 242.4370 254.5003 275.4309 313.8802 323.9047 344.7079 361.8243 382.1647 399.3018 440.6466 497.3387 499.9756 569.9235 588.5797 670.3350 705.2892 764.4316 783.0472 795.1251 857.8137 902.1937 939.6406 956.6575 969.5544 1000.0687 1035.2211 1045.4191 1056.6021 1084.3137 1111.1349 1114.3175 1134.1613 1152.6694 1164.5789 1183.3162 1214.3927 1246.2212 1270.9628 1298.7390 1301.8927 1312.6375 1349.2340 1351.3826 1367.4464 1379.4237 1385.8341 1394.7310 1409.1709 1437.3527 1448.2196 1460.5468 1462.3916 1468.4198 1475.5158 1487.0156 1489.7301 2952.5380 2996.8529 3005.9571 3006.0407 3016.4606 3031.3198 3032.4101 3043.6826 3077.5960 3103.8186 3107.8673 3111.1529 3116.4266 3126.3329 3546.4322
redmass: 13.2074 2.6539 3.6339 4.2686 1.1306 1.3449 3.6448 2.1235 2.0115 2.7576 2.1564 1.8997 2.3573 3.1516 3.2519 3.3961 3.4622 4.0425 3.2606 4.9069 2.8217 3.7677 4.0131 4.3638 6.5197 3.3019 6.8421 3.7257 3.5021 2.6843 3.5193 3.0533 2.2871 1.7608 3.7440 1.7483 2.8320 3.7369 2.4452 1.7200 1.2719 2.0338 1.5025 2.5918 2.8253 7.5959 1.4631 1.7564 1.2661 1.2264 1.5232 1.2812 1.3814 1.3713 1.2080 1.2270 1.3077 4.0557 1.1657 1.0929 1.0630 1.0560 1.0539 1.0541 1.0584 1.0537 1.0332 1.0623 1.0406 1.0774 1.0363 1.0866 1.0845 1.1023 1.1017 1.1001 1.0992 1.1003 1.0974 1.1012 1.0650
irintensity: 0.1522 4.3809 0.5225 5.0735 0.6938 1.0016 5.9102 1.4245 1.1037 5.9728 0.7840 56.7756 16.1729 0.9750 10.9751 41.4615 4.5241 1.8144 55.2205 5.0781 19.2283 1.6044 2.3492 1.5707 3.2054 6.3324 16.3042 4.7566 28.4519 13.6455 22.2219 27.7464 15.0956 20.4783 173.8416 69.9110 27.4568 167.2407 40.2186 16.3023 7.1636 7.2076 14.2512 2.0270 15.5535 63.8494 38.8698 33.8430 2.4674 2.6629 2.3233 4.3341 15.4518 41.5327 31.6098 29.8948 77.6245 92.7834 3.2544 12.1833 0.9977 8.6135 18.6432 10.2306 14.6957 7.3246 63.6413 7.9251 5.4637 12.7483 11.1739 31.9972 20.7530 44.0454 14.3290 11.8825 37.0098 22.8111 11.9130 5.0872 19.6478
temp: 298.150 k
press: 1.00000 atm
elementType: 8 8 8 8 8 7 6 6 6 6 6 6 6 6 1 1 1 1 1 1 1 1 1 1 1 1 1 1 1
symmnumber: 1
zpe: 612955.0 jmol-1
zpe.correction: 0.233462 hartree
zpe.thermalcorrener: 0.249035 hartree
zpe.thermalcorrenthalpy: 0.249979 hartree
zpe.thermalcorrgfe: 0.190412 hartree
zpe.sumelectzpe: -743.474107 hartree
zpe.sumelectthermal: -743.458534 hartree
zpe.sumelectthermalent: -743.457590 hartree
zpe.sumelectthermalfe: -743.517157 hartree
dipole: -0.3577 2.7186 -0.1917
dipole: 2.7487
quadrupole: -98.5039 -84.6403 -80.0971
quadrupole: 8.5454 0.0002 -0.5460
quadrupole: -10.7568 3.1068 7.6500 8.5454 0.0002 -0.5460
hfenergy: -743.7075692 hartree
pointgroup: C01 [X(C8H15N1O5)]
dipole: 0.2889601 -1.0406846 -0.0541131 debye
polarizability: 117.0915851|3.1000854|115.2508347|1.9620039|5.1785486|99.5726195 unknown
InChI: InChI=1S/C8H15NO5/c1-5-7(13-3)8(2,9(11)12)4-6(10)14-5/h5-7,10H,4H2,1-3H3
charge 0 multiplicity 1
29 atoms
O  2.177835 -0.490474 -0.64093
O  -1.257849 -1.803229 0.243308
O  3.16728 1.615744 -0.447061
O  -2.275386 2.109455 0.447339
O  -2.19269 0.737609 -1.355002
N  -1.749954 1.148917 -0.219353
C  -0.413347 0.494702 0.362149
C  -0.259489 -0.887669 -0.316779
C  0.723285 1.4394 -0.124095
C  1.175889 -1.491919 -0.18589
C  2.114107 0.794729 0.077668
C  -0.56006 0.460681 1.891907
C  1.53977 -2.11373 1.171712
C  -1.969317 -2.593131 -0.772895
H  -0.447255 -0.734782 -1.397878
H  0.681256 2.39922 0.419946
H  0.602556 1.644463 -1.20602
H  1.259314 -2.280379 -0.95585
H  2.364258 0.666991 1.146638
H  0.421073 0.299564 2.366331
H  -0.961837 1.420938 2.25145
H  -1.235692 -0.355144 2.1933
H  0.763036 -2.843433 1.458552
H  2.50921 -2.632865 1.085623
H  1.620161 -1.373557 1.984127
H  3.11715 1.602514 -1.438162
H  -1.281874 -3.265671 -1.324712
H  -2.494135 -1.928829 -1.485889
H  -2.702297 -3.199612 -0.218236
