program: Gaussian 09
title: 000194307
version: EM64L-G09RevD.01
frameworkgroup: C1[X(C10H15IN2O)]
method: RPBEPBE
basis: SDD
operation: Freq
keyword: #p
keyword: freq=noraman
keyword: PBEPBE/SDD
title: #p freq=noraman PBEPBE/SDD
converged: YES YES NO NO
title: Mulliken charges:
elementType: I O N N C C C C C C C C C C H H H H H H H H H H H H H H H
charge: 0.089116 -0.405449 0.069522 -0.521648 0.196373 0.092653 -0.700796 -0.701515 -0.705251 -0.424483 0.319563 0.338492 -0.591587 -0.625920 0.228614 0.214651 0.205868 0.206207 0.215228 0.228467 0.196342 0.227857 0.229498 0.239719 0.210056 0.247535 0.278284 0.278875 0.363727
chargesum: 0.00000
title: Mulliken charges with hydrogens summed into heavy atoms:
elementType: I O N N C C C C C C C C C C
charge: 0.089116 -0.041721 0.069522 0.035511 0.196373 0.092653 -0.051663 -0.051613 -0.051553 -0.184764 0.319563 0.338492 -0.133996 -0.625920
polarizability: 2.07140254e+02 -7.01311333e+00 1.68954312e+02 1.45087006e+00 -3.06009311e+00 8.99659846e+01
1716.lowfreq: -9.6148 -1.6284 0.0005 0.0005 0.0008 9.2536 14.8485 51.5045 74.3129
frequency: 14.2825 51.4942 74.3043 88.4865 108.2688 154.4109 172.3953 188.8463 204.6233 213.6410 230.5800 255.7953 266.5498 301.2579 307.6811 317.6380 339.3186 359.3088 370.1062 415.6886 441.7181 481.7257 528.2371 548.8581 587.6605 639.8111 684.6160 690.4916 770.7324 787.4551 820.8113 866.7149 887.2516 908.5726 922.3662 935.3016 947.8727 1020.7609 1025.0849 1069.7125 1088.1198 1109.4145 1136.7426 1173.7347 1204.9761 1216.5075 1239.2711 1298.0211 1318.4987 1321.4360 1332.3103 1349.0631 1374.5063 1380.7801 1404.9900 1432.6266 1454.3072 1460.7887 1464.2250 1470.6200 1475.7999 1481.6166 1495.0880 1521.7577 1581.0651 1655.8530 2962.5970 2972.9554 2975.7536 2988.5903 3056.2535 3067.6538 3072.5349 3075.4716 3079.2693 3086.1683 3099.7327 3134.6973 3454.8727 3554.8984 3579.0469
redmass: 2.8579 3.3747 5.1172 5.1180 5.5663 3.7641 3.3081 1.1066 2.8699 2.2061 1.8602 1.1816 1.1112 2.8634 3.2081 2.1708 1.8810 1.3776 2.8267 3.2004 4.3868 3.9607 3.5602 3.5397 2.4949 2.2066 6.3047 6.4634 5.1715 5.9870 3.4688 1.3645 2.8419 1.7317 1.7005 1.6106 1.2081 1.4029 1.3975 4.2893 2.2889 1.6609 1.4278 2.6520 2.9107 2.8870 2.1074 3.0582 4.5786 1.3154 2.0311 2.6048 1.1864 1.2182 1.2368 2.6605 1.0498 1.0492 1.0488 1.1693 1.0525 1.0564 1.1078 7.0679 6.9747 1.0845 1.0690 1.0344 1.0349 1.0365 1.0943 1.0999 1.0993 1.1008 1.0998 1.0989 1.0992 1.0912 1.0454 1.0658 1.0975
irintensity: 0.0003 1.5729 0.2485 1.4008 0.3002 7.4873 7.9868 0.6672 24.9903 20.9731 13.9255 1.1726 1.0431 0.4720 6.6511 3.4522 43.0529 77.0532 8.6978 1.2182 3.3504 5.1753 1.2829 3.0037 94.8720 264.2422 43.5671 42.5469 7.4280 13.6188 15.8951 1.4449 47.6535 16.8482 3.4241 2.6744 0.8499 2.2856 3.0552 24.6660 10.2661 181.1693 70.3269 155.2885 7.4454 6.4452 0.2538 42.7859 47.6095 0.6137 8.4675 38.3368 18.3928 26.9634 2.7562 92.5306 0.7292 0.5906 0.4886 21.1011 11.7268 11.9408 45.1605 92.3932 32.0718 34.5882 46.8947 31.5005 32.2098 31.0833 17.8257 1.5994 63.1941 14.4213 21.6575 88.7033 30.4081 15.9058 4.8661 27.2747 2.4150
temp: 298.150 k
press: 1.00000 atm
elementType: 53 8 7 7 6 6 6 6 6 6 6 6 6 6 1 1 1 1 1 1 1 1 1 1 1 1 1 1 1
symmnumber: 1
zpe: 613702.5 jmol-1
zpe.correction: 0.233747 hartree
zpe.thermalcorrener: 0.249901 hartree
zpe.thermalcorrenthalpy: 0.250845 hartree
zpe.thermalcorrgfe: 0.188476 hartree
zpe.sumelectzpe: -585.205624 hartree
zpe.sumelectthermal: -585.189470 hartree
zpe.sumelectthermalent: -585.188526 hartree
zpe.sumelectthermalfe: -585.250895 hartree
dipole: -3.3754 2.7973 -0.3408
dipole: 4.3971
quadrupole: -94.9636 -98.9584 -97.7518
quadrupole: 2.3684 -0.9121 -1.7491
quadrupole: 2.2610 -1.7338 -0.5272 2.3684 -0.9121 -1.7491
hfenergy: -585.439371 hartree
pointgroup: C01 [X(C10H15I1N2O1)]
dipole: -0.039656 -1.7100655 0.2585288 debye
polarizability: 178.5058681|17.6556045|196.4741129|-3.2935636|-11.414917|91.0805695 unknown
InChI: InChI=1S/C10H15IN2O/c1-10(2,3)7-4-6(5-12)8(14)9(11)13-7/h4,14H,5,12H2,1-3H3
charge 0 multiplicity 1
29 atoms
I  1.398415 3.52655 -0.449432
O  3.078175 0.83256 0.07902
N  -0.565654 1.235093 -0.170902
N  2.949518 -2.383507 -0.889205
C  -2.563094 -0.263351 0.000632
C  -1.039795 -0.034044 0.024031
C  -3.009474 -0.88428 1.358314
C  -2.912605 -1.244908 -1.158551
C  -3.319065 1.069253 -0.219326
C  -0.121002 -1.09506 0.236873
C  1.271856 -0.860686 0.256211
C  1.723707 0.480493 0.080214
C  2.280209 -2.009192 0.376261
C  0.747168 1.480254 -0.139894
H  -2.775685 -0.2038 2.197148
H  -4.10141 -1.05904 1.350985
H  -2.514735 -1.853283 1.554788
H  -2.409541 -2.222171 -1.038963
H  -4.003126 -1.426495 -1.181954
H  -2.613369 -0.82084 -2.134234
H  -4.40853 0.878513 -0.232257
H  -3.094521 1.793662 0.582014
H  -3.02855 1.541067 -1.173164
H  -0.488983 -2.116956 0.381583
H  3.065979 -1.777179 1.125399
H  1.760664 -2.901424 0.766967
H  3.544858 -1.6514 -1.291388
H  2.310026 -2.76824 -1.591623
H  3.631165 0.138214 0.518853
