program: Gaussian 09
title: 000194306
version: EM64L-G09RevD.01
frameworkgroup: C1[X(C12H17N3O8)]
method: RPBEPBE
basis: SDD
operation: Freq
keyword: #p
keyword: freq=noraman
keyword: PBEPBE/SDD
title: #p freq=noraman PBEPBE/SDD
converged: YES YES NO NO
title: Mulliken charges:
elementType: O O O O O O O O N N N C C C C C C C C C C C C H H H H H H H H H H H H H H H H H
charge: -0.246128 -0.470766 -0.441199 -0.480729 -0.313919 -0.249443 -0.399285 -0.273178 -0.171087 -0.399232 -0.316163 -0.188422 -0.136602 -0.094963 -0.062137 -0.348286 -0.201148 0.240070 0.187183 0.057555 -0.477012 -0.422253 0.226509 0.237368 0.222984 0.291646 0.286796 0.178604 0.213955 0.365637 0.395094 0.374821 0.363034 0.228833 0.252126 0.405395 0.268918 0.261352 0.242732 0.391339
chargesum: 0.00000
title: Mulliken charges with hydrogens summed into heavy atoms:
elementType: O O O O O O O O N N N C C C C C C C C C C C C
charge: -0.246128 -0.075672 -0.066378 -0.075334 -0.313919 -0.249443 -0.007946 -0.273178 -0.171087 -0.036198 -0.047245 0.048947 0.086382 0.196683 0.224659 0.044274 0.164488 0.240070 0.187183 0.057555 0.003948 0.081831 0.226509
polarizability: 2.29887566e+02 1.13240734e+01 1.98248583e+02 4.98678870e+00 -2.97925588e+00 1.08242807e+02
1716.lowfreq: -6.0409 -0.7372 0.0004 0.0008 0.0010 2.8910 25.4367 47.1571 51.1951
frequency: 25.2584 47.1399 51.1845 68.8551 71.8869 86.9228 93.3337 97.7878 116.3978 124.2721 145.0173 159.9317 183.7158 201.8848 213.7872 225.8885 251.2822 270.2745 295.1354 316.4615 327.4993 345.0094 376.4658 386.3062 403.3825 435.1534 459.4442 477.6660 507.0948 516.9738 536.9666 560.5150 571.5547 592.5964 611.2229 626.2825 653.1459 653.8157 657.6971 680.2902 708.4599 715.9305 723.8620 750.5973 782.0128 791.4454 799.9225 859.9495 868.9991 895.8429 952.9048 967.6119 971.0567 986.7242 993.9229 1001.4502 1034.5618 1045.7722 1056.7497 1063.3886 1069.6305 1072.7355 1086.5314 1091.4038 1113.2452 1175.5959 1182.7885 1186.4574 1210.3654 1223.0834 1224.8509 1247.0263 1255.2009 1263.6079 1266.7221 1270.9379 1299.7548 1312.4326 1322.3940 1329.5645 1334.6304 1337.8044 1363.5047 1370.5766 1379.4693 1381.8284 1391.5505 1427.0897 1432.3531 1451.3235 1463.9820 1476.5291 1494.6447 1602.0146 1615.0134 1647.5054 1651.7374 2897.3661 2901.8096 2936.9593 2956.5996 2976.2746 2994.8056 2997.1284 3006.5226 3040.5632 3094.0124 3103.9869 3364.8499 3404.9504 3460.3187 3477.1335 3516.0026 3522.8305
redmass: 6.5522 5.4239 6.1477 7.1313 7.8147 4.5486 7.3679 3.7836 5.4851 3.5387 5.2974 3.8965 6.9514 5.4808 6.0007 6.2410 5.0675 5.0231 4.8051 4.6594 8.1858 4.9734 7.1646 7.1519 6.5317 3.6818 5.2371 1.4044 2.1265 2.4860 4.3630 4.6287 1.5007 3.4684 3.3960 3.5424 1.2784 1.3455 1.2126 4.3520 2.3111 6.2125 4.2222 5.5351 2.7419 3.9879 4.1804 3.9155 3.3167 3.0876 2.2854 2.1345 2.6587 2.4689 1.7443 2.7197 3.7619 6.9473 3.9214 2.3848 4.4365 2.5432 2.3938 3.1316 5.4828 2.7916 1.2102 1.2229 1.1287 1.6236 2.0606 1.2226 1.4831 1.5604 1.2248 1.6208 1.1962 1.4250 1.2255 1.5058 1.2240 1.6967 1.5076 1.9352 1.7490 1.5022 1.7449 3.0730 1.5242 1.1217 1.2152 1.0782 1.0828 4.8019 10.7664 6.2537 7.7531 1.0702 1.0600 1.0640 1.0982 1.0850 1.0868 1.0955 1.0867 1.0869 1.0980 1.0885 1.0691 1.0655 1.0649 1.0752 1.0642 1.0772
irintensity: 0.1137 1.3327 3.2689 2.4446 1.6147 1.3278 3.7298 7.9970 0.9742 6.3830 6.0046 5.0219 3.3608 0.6541 4.3872 3.2961 16.9580 10.8272 3.4223 8.7695 5.8393 17.9977 2.1980 18.0946 16.9432 5.1385 56.3497 118.5780 12.1800 36.3267 46.8984 13.1379 136.0846 41.2619 76.1045 2.8950 48.4466 226.2664 78.7577 1.5126 11.6597 8.5607 22.7171 6.7485 83.1627 36.2228 38.6682 4.0516 1.0362 6.3970 10.4214 20.5409 3.8864 91.7713 27.3228 87.9909 14.9715 117.9369 97.7500 249.1644 70.1955 27.8600 102.3373 39.0442 40.6076 26.3242 13.4240 0.2219 4.9748 65.3143 21.9487 42.9604 45.1497 59.3646 23.5233 32.3453 64.1782 50.0218 6.0856 58.9697 71.6721 29.7770 4.0513 43.0228 14.3667 143.0179 16.8166 117.9655 8.5378 20.7459 17.6903 7.9337 12.6951 164.5431 211.0729 351.2659 618.9586 88.1247 61.9746 39.9276 55.7722 38.2941 70.9071 26.1535 4.9376 10.6339 72.3601 15.1957 591.2219 164.3838 38.5646 1.2852 41.2161 62.0841
temp: 298.150 k
press: 1.00000 atm
elementType: 8 8 8 8 8 8 8 8 7 7 7 6 6 6 6 6 6 6 6 6 6 6 6 1 1 1 1 1 1 1 1 1 1 1 1 1 1 1 1 1
symmnumber: 1
zpe: 801944.6 jmol-1
zpe.correction: 0.305445 hartree
zpe.thermalcorrener: 0.327418 hartree
zpe.thermalcorrenthalpy: 0.328363 hartree
zpe.thermalcorrgfe: 0.253837 hartree
zpe.sumelectzpe: -1231.766143 hartree
zpe.sumelectthermal: -1231.744169 hartree
zpe.sumelectthermalent: -1231.743225 hartree
zpe.sumelectthermalfe: -1231.817750 hartree
dipole: 5.1402 -0.7547 -2.5020
dipole: 5.7664
quadrupole: -125.4110 -151.9148 -134.0709
quadrupole: -17.0984 -0.3417 9.2002
quadrupole: 11.7212 -14.7826 3.0614 -17.0984 -0.3417 9.2002
hfenergy: -1232.0715873 hartree
pointgroup: C01 [X(C12H17N3O8)]
dipole: 2.0163474 -0.694263 -0.7740965 debye
polarizability: 230.2075629|2.9502998|195.0689494|19.7690011|0.7248466|111.1024435 unknown
InChI: InChI=1S/C12H17N3O8/c16-4-6-8(19)9(20)11(23-6)15-3-5(1-13-2-7(17)18)10(21)14-12(15)22/h3,6,8-9,11,13-14,16-17,19-20H,1-2,4H2
charge 0 multiplicity 1
40 atoms
O  -1.976559 -1.121163 1.145689
O  -4.186662 0.407653 -1.190008
O  -4.436445 -2.092362 -0.342142
O  0.303799 -2.62198 0.556469
O  -2.679222 2.676096 -0.379959
O  1.817186 3.834012 0.237163
O  5.229892 -3.004391 0.353209
O  2.991869 -3.001456 -0.226355
N  -1.202329 1.053673 0.447724
N  -0.425382 3.225492 -0.007134
N  2.845758 -0.211587 0.303793
C  -2.915444 -0.232238 -0.911806
C  -3.117353 -1.773792 -0.864122
C  -2.377981 0.104716 0.517766
C  -2.039588 -2.231714 0.139076
C  -0.665901 -2.472237 -0.512984
C  0.088902 0.660776 0.778447
C  -1.507078 2.348975 -0.000297
C  1.159623 1.529636 0.711842
C  0.940404 2.92409 0.320675
C  2.569835 1.057896 1.018461
C  4.050911 -0.938428 0.685223
C  3.990531 -2.389218 0.221128
H  -2.156816 0.037449 -1.67399
H  -2.977485 -2.229579 -1.865703
H  -3.158465 0.59597 1.126354
H  -2.360625 -3.11634 0.709382
H  -0.401663 -1.625279 -1.189244
H  -0.740456 -3.39075 -1.136792
H  0.203124 -0.392933 1.069186
H  -4.04922 1.386001 -1.029904
H  -5.027433 -1.3238 -0.577473
H  -0.618757 4.184521 -0.314158
H  2.684094 0.858746 2.103018
H  3.270438 1.884599 0.766772
H  1.23602 -2.687598 0.197107
H  2.722948 -0.124864 -0.711765
H  4.126589 -0.958025 1.791381
H  5.019149 -0.514523 0.326649
H  5.16769 -3.961244 0.084217
