program: Gaussian 09
title: 000194299
version: EM64L-G09RevD.01
frameworkgroup: C1[X(C6H12ClO5P)]
method: RPBEPBE
basis: SDD
operation: Freq
keyword: #p
keyword: freq=noraman
keyword: PBEPBE/SDD
title: #p freq=noraman PBEPBE/SDD
converged: YES YES NO NO
title: Mulliken charges:
elementType: Cl P O O O O O C C C C C C H H H H H H H H H H H H
charge: -0.017286 1.384488 -0.520847 -0.170944 -0.675211 -0.686162 -0.585401 -0.370352 -0.367039 -0.506606 -0.265277 0.287041 -0.700969 0.212319 0.235564 0.213249 0.218749 0.247091 0.234423 0.243109 0.229218 0.279232 0.281276 0.395519 0.404815
chargesum: 0.00000
title: Mulliken charges with hydrogens summed into heavy atoms:
elementType: Cl P O O O O O C C C C C C
charge: -0.017286 1.384488 -0.520847 -0.170944 -0.279692 -0.281347 -0.585401 0.077531 0.064960 -0.025092 0.207050 0.287041 -0.140461
polarizability: 1.60364255e+02 6.48245433e+00 1.00478376e+02 2.28616891e+00 1.12500476e-01 8.33718464e+01
1716.lowfreq: -7.5838 0.0025 0.0028 0.0028 1.6884 4.6732 14.0500 19.1649 32.3267
frequency: 13.9471 19.1267 32.1436 44.5018 69.9481 73.9726 111.6870 122.0123 127.6422 147.9321 163.4743 201.6064 236.4553 252.8408 287.7133 314.7911 347.8229 362.6978 379.6727 415.1918 441.0742 459.5293 630.0265 647.0975 710.5532 722.6586 734.0390 743.5285 771.8726 828.1643 873.3230 923.0906 936.4103 1000.1210 1010.8049 1014.2697 1055.5908 1061.1684 1079.8996 1092.2487 1107.8354 1143.0356 1171.8902 1236.3004 1246.5105 1272.9436 1283.1455 1290.4951 1318.9497 1359.0585 1376.4695 1409.5724 1432.4284 1469.6433 1477.8855 1489.9037 1657.0596 2956.6706 2990.8129 2995.6209 3003.0662 3009.4692 3023.9823 3040.5687 3062.3816 3084.4437 3095.9395 3591.3900 3614.6392
redmass: 7.0191 6.2498 5.1462 5.8785 3.3286 2.4683 4.0829 2.3101 2.6404 9.6721 1.7869 4.2834 2.9878 4.6776 2.6105 6.3067 4.6009 2.7122 2.7998 4.9813 2.9534 3.1486 9.8739 6.4926 1.9208 10.3915 2.0446 5.7597 1.2831 1.7496 2.7192 1.5274 6.8411 1.3653 3.6005 1.2336 3.1289 1.5993 2.1866 4.0032 2.9999 1.3139 1.2374 1.2937 1.2666 1.3770 1.1105 1.1104 1.4128 1.5213 1.4270 1.0850 1.0865 1.0759 1.0919 1.0905 9.1309 1.0617 1.0614 1.0596 1.0590 1.0935 1.0576 1.1008 1.1039 1.1080 1.1059 1.0662 1.0665
irintensity: 6.7444 5.1913 3.4641 1.6551 1.6197 2.0092 2.9116 1.7342 1.8937 1.9134 81.6977 9.7884 19.6221 19.9979 22.5020 85.3180 49.0332 27.8746 85.5339 19.3798 0.9334 3.7206 29.7429 35.4589 16.3327 249.3804 61.8841 136.4626 4.0519 1.9543 2.6984 12.3756 189.2536 30.3260 41.3664 129.8628 12.4549 2.7996 21.9103 207.9337 14.2897 2.5717 4.1697 6.3869 49.5549 22.3070 0.8827 0.1399 11.7794 6.2203 8.2616 27.1915 18.4760 0.0144 5.5359 18.0687 78.4621 14.5853 0.4144 8.2561 54.7866 8.4148 14.3428 0.6624 11.4799 56.9972 4.5607 65.2419 69.3209
temp: 298.150 k
press: 1.00000 atm
elementType: 17 15 8 8 8 8 8 6 6 6 6 6 6 1 1 1 1 1 1 1 1 1 1 1 1
symmnumber: 1
zpe: 482530.3 jmol-1
zpe.correction: 0.183786 hartree
zpe.thermalcorrener: 0.200743 hartree
zpe.thermalcorrenthalpy: 0.201688 hartree
zpe.thermalcorrgfe: 0.134621 hartree
zpe.sumelectzpe: -1412.170697 hartree
zpe.sumelectthermal: -1412.153740 hartree
zpe.sumelectthermalent: -1412.152796 hartree
zpe.sumelectthermalfe: -1412.219862 hartree
dipole: -0.7034 -0.5236 -0.2526
dipole: 0.9125
quadrupole: -116.8899 -98.1164 -84.2906
quadrupole: -32.9572 4.4398 1.0893
quadrupole: -17.1243 1.6492 15.4751 -32.9572 4.4398 1.0893
hfenergy: -1412.3544832 hartree
pointgroup: C01 [X(C6H12Cl1O5P1)]
dipole: 0.2814667 -0.2076667 0.080893 debye
dipolederiv: -0.5620703 0.0574618 0.0262054 0.1460169 -0.1431925 -0.0090621 0.0565553 -0.0030633 -0.1423969 2.4336141 -0.0808371 0.0632984 0.4244252 1.7404318 0.10598 -0.0477297 -0.0225652 1.9631982 -1.7346402 0.1017913 -0.053604 0.246544 -0.4571706 -0.0138328 -0.0560992 -0.012435 -0.5054885 -0.5825008 0.003194 -0.0169252 -0.0099971 -0.7623675 -0.0709553 -0.0263771 -0.0679988 -0.2773436 -0.7782423 -0.1174912 0.0134866 -0.2577416 -0.7171455 -0.3943605 -0.0802611 -0.3047594 -0.8606762 -0.5928548 0.1024838 0.0937069 -0.0470911 -0.80423 0.2619251 0.2309166 0.2414303 -0.9173569 -0.7940879 0.0601912 0.0054162 -0.0004088 -0.6404935 -0.0204362 -0.0280651 0.0038236 -0.618367 0.0449538 -0.0079571 0.0014851 -0.0560064 0.0308503 0.0080111 0.0316105 -0.00424 0.1525916 -0.2024146 -0.0175711 0.0095054 0.051957 0.0894568 0.0215279 -0.0111737 0.0198187 0.1527368 -0.4685907 0.1413138 -0.0222157 0.2021548 -0.0791021 0.0323796 -0.1060524 0.0718805 0.151735 0.9726401 -0.0737805 0.0167081 -0.4550832 0.2490922 0.0167599 0.0760115 0.0187634 0.3362046 1.0372815 -0.0138019 0.115614 0.1291054 0.845799 0.1023024 0.2060745 0.0868964 0.110118 0.3457506 -0.3008891 -0.1212245 -0.4416741 0.0081882 -0.0525888 -0.2132517 -0.0625131 0.1450091 0.0446226 -0.0025321 0.0024809 -0.005842 0.0351266 0.0792504 -0.0094187 0.0907499 -0.1124001 0.0778424 -0.0038704 -0.0065339 -0.0191514 -0.0357784 -0.0855258 -0.000692 -0.0936074 0.0050757 0.0675545 -0.0008208 0.0040804 -0.0080011 0.0340153 0.0734601 -0.0001172 0.0910043 -0.1113571 0.0730244 -0.0076714 -0.0082658 -0.0035858 -0.0592935 -0.093955 0.0033433 -0.1096124 -0.0062304 0.063516 0.0171727 0.0026514 -0.0256084 0.0534904 0.0651517 0.0360455 0.0837953 -0.0555128 0.0632565 -0.0185597 -0.0205614 -0.0838876 -0.0271366 -0.0933369 -0.0110526 -0.1264781 0.0031074 -0.0052422 0.0161537 0.0010242 0.0658712 0.0337806 0.0503939 -0.0323375 0.0775455 -0.0726986 -0.014861 0.0008027 -0.0151766 0.0625507 -0.0513341 -0.0743927 -0.0052812 -0.1046796 -0.0114852 -0.0126475 0.0799486 -0.0181557 0.0686936 -0.0213918 0.0660412 0.0181892 0.0852061 0.0621908 -0.0144171 0.04069 0.0547389 0.0426071 0.0851259 -0.0425083 0.0365823 -0.0601958 -0.0283546 0.3471052 0.092078 -0.0521782 0.0782903 0.2552622 0.0620986 -0.0436598 0.1007058 0.2656805 0.1914076 -0.0674995 -0.0755608 -0.1041378 0.3380169 0.0056727 -0.0237597 0.0005282 0.3720205 unknown
polarizability: 160.5962773|-5.6650432|100.2306589|0.47693|1.1212382|83.3875414 unknown
InChI: InChI=1S/C6H12ClO5P/c7-5-6(8)3-1-2-4-12-13(9,10)11/h9-10H,1-5H2
charge 0 multiplicity 1
25 atoms
Cl -6.492675 0.056918 0.172558
P  4.215198 -0.028853 -0.055614
O  2.634076 -0.651313 0.041815
O  -3.701378 1.299102 0.32081
O  4.342562 1.228538 1.137972
O  4.056649 0.960545 -1.449041
O  5.35152 -1.124665 0.013182
C  -1.087465 0.159822 -0.071228
C  0.224602 -0.637225 0.110153
C  -2.330135 -0.724696 0.153888
C  1.447461 0.246273 -0.133288
C  -3.646994 0.063411 0.132087
C  -4.877172 -0.809411 -0.141181
H  -1.130837 0.595847 -1.088395
H  -1.127185 1.012589 0.631701
H  0.280999 -1.055922 1.133102
H  0.260809 -1.491125 -0.592897
H  -2.266649 -1.217279 1.148829
H  -2.373347 -1.550986 -0.584501
H  1.46901 0.658039 -1.158002
H  1.510952 1.075447 0.597188
H  -4.861889 -1.713455 0.490569
H  -4.881846 -1.116647 -1.20202
H  4.793815 0.942467 1.973088
H  4.81382 1.57058 -1.632274
