program: Gaussian 09
title: 000194267
version: EM64L-G09RevD.01
frameworkgroup: C1[X(C16H18O8)]
method: RPBEPBE
basis: SDD
operation: Freq
keyword: #pfreq=noraman
keyword: PBEPBE/SDD
title: #p freq=noraman PBEPBE/SDD
converged: YES YES NO NO
title: Mulliken charges:
elementType: O O O O O O O O C C C C C C C C C C C C C C C C H H H H H H H H H H H H H H H H H H
charge: -0.278874 -0.246590 -0.444259 -0.452322 -0.465893 -0.428840 -0.249683 -0.193352 -0.187594 -0.095857 -0.140727 -0.042816 -0.134469 -0.369718 0.383034 -0.475506 -0.428922 0.233831 0.201124 -0.356305 0.406110 -0.479532 -0.809190 0.127190 0.261713 0.213284 0.261294 0.242926 0.234138 0.257338 0.190340 0.367973 0.365075 0.378203 0.354897 0.307207 0.263097 0.250144 0.255650 0.243067 0.241008 0.241805
chargesum: 0.00000
title: Mulliken charges with hydrogens summed into heavy atoms:
elementType: O O O O O O O O C C C C C C C C C C C C C C C C
charge: -0.278874 -0.246590 -0.076286 -0.087247 -0.087690 -0.073943 -0.249683 -0.193352 0.074119 0.117427 0.120567 0.200109 0.099669 0.077961 0.383034 -0.168299 -0.165825 0.233831 0.201124 -0.106161 0.406110 -0.223882 -0.083310 0.127190
polarizability: 2.94978713e+02 2.28571939e+01 2.20486875e+02 2.57529654e+00 -2.02743478e+01 1.23074613e+02
1716.lowfreq: -21.7011 -3.3291 -0.0003 0.0002 0.0004 1.9992 8.8137 22.9494 27.1685
frequency: -19.1875 22.9177 27.0163 54.9034 77.6387 89.6114 96.8645 108.2240 116.4375 151.2379 167.5662 174.5186 183.3118 199.8065 205.9931 219.5008 240.8479 250.9451 274.6186 291.8054 314.2721 316.8376 332.7174 373.5124 398.4021 417.2587 422.3004 431.0596 445.9879 452.6766 460.9315 487.3034 512.0023 544.7031 553.3842 564.0331 574.3300 591.6209 622.8079 660.9094 668.8129 669.5366 718.2216 744.3465 746.4273 769.6546 785.6561 823.0923 824.5201 845.4681 864.7668 876.3114 901.9640 936.3843 958.4368 961.4320 967.0375 996.4195 1009.8873 1016.8567 1026.8595 1036.2653 1046.3580 1049.1551 1055.5720 1090.3514 1091.3894 1114.4770 1120.5362 1136.7597 1168.0053 1181.1269 1199.0717 1217.2031 1229.1011 1238.8560 1247.5267 1251.3159 1261.0737 1271.4864 1285.8090 1291.0055 1319.5498 1340.7047 1347.1966 1354.3099 1369.2521 1378.3534 1381.8114 1384.4562 1389.0978 1397.0130 1401.0576 1427.6383 1459.9706 1467.7591 1470.8454 1498.6714 1557.2034 1611.0476 1617.8509 1693.0838 2937.5319 2950.9780 2960.3428 2982.3790 2984.7893 3038.9400 3055.3317 3059.1359 3104.3666 3109.8105 3153.6155 3172.7809 3179.9130 3182.1561 3484.6071 3534.4493 3549.4974 3553.6821
redmass: 3.0833 5.7594 6.6452 4.5576 4.3248 3.7193 5.7013 5.3218 6.3442 2.7253 1.6419 4.6096 4.5099 2.8702 1.8503 4.1904 5.3164 5.6483 5.3154 4.4908 4.0686 5.4923 4.9374 3.5302 4.1443 5.8508 1.5056 1.7734 1.8357 2.8723 7.1664 4.6971 5.7790 4.1033 4.7496 1.1787 3.0836 5.2315 4.0567 5.1034 5.4615 4.2720 5.1760 3.7476 4.4843 5.5993 6.0582 1.5037 3.9638 3.3205 1.6207 1.3841 3.1888 5.5832 1.3462 3.4707 3.8424 1.8099 3.4550 3.2642 3.6627 3.9105 1.5776 2.9269 3.6321 2.8238 2.6144 2.4931 2.8337 1.8079 1.9030 1.2777 1.3253 1.4528 2.5894 1.4135 1.2190 1.8425 1.2820 1.3697 1.3342 1.2958 1.2242 1.2242 1.3099 1.2673 1.4060 1.3111 2.2188 1.2964 3.8841 1.7807 1.4283 5.2347 1.0807 1.0455 1.1053 3.4824 7.2143 7.5035 7.0466 10.5359 1.0835 1.0820 1.0714 1.0382 1.0831 1.0850 1.0872 1.0969 1.0984 1.0939 1.0886 1.0920 1.0951 1.0939 1.0648 1.0655 1.0658 1.0660
irintensity: 26.4666 1.3428 0.5524 14.8063 5.7762 27.5184 0.8521 3.1489 2.8202 25.9098 0.0182 2.7715 2.2855 4.1693 1.0765 6.2143 25.4404 2.3025 3.4830 11.2100 3.8634 5.8010 6.5240 11.3964 3.8514 13.2327 139.2175 80.0445 49.6559 3.8046 14.2225 6.3060 0.7014 2.1112 9.0613 205.9631 9.8358 7.1147 1.1825 8.4720 4.4174 3.8170 6.3153 0.2655 14.5234 21.0970 55.0202 28.1130 15.9821 69.8880 28.8961 40.0568 137.0067 168.6351 3.4033 172.7345 51.9200 25.7662 62.9479 54.9991 133.3545 71.9938 8.0410 72.6837 70.6002 12.5163 35.0528 110.8153 9.0649 36.8808 82.2925 5.3014 113.2225 69.0985 64.9586 59.9722 14.6767 131.1761 5.5558 67.1591 18.0365 5.1037 12.4281 72.3107 7.9924 11.2742 16.5229 0.5290 114.1874 33.4799 9.8140 18.4957 61.9518 19.1473 5.8972 17.3900 9.9877 21.4742 18.6028 61.5167 374.0823 502.9071 24.4302 18.6973 28.3727 11.5143 63.1118 14.5649 31.9992 12.2349 20.5643 7.3009 5.8310 1.5769 1.5903 2.7335 27.1757 22.5804 9.6632 20.2289
temp: 298.150 k
press: 1.00000 atm
elementType: 8 8 8 8 8 8 8 8 6 6 6 6 6 6 6 6 6 6 6 6 6 6 6 6 1 1 1 1 1 1 1 1 1 1 1 1 1 1 1 1 1 1
symmnumber: 1
zpe: 843286.7 jmol-1
zpe.correction: 0.321191 hartree
zpe.thermalcorrener: 0.343348 hartree
zpe.thermalcorrenthalpy: 0.344293 hartree
zpe.thermalcorrgfe: 0.269855 hartree
zpe.sumelectzpe: -1220.463577 hartree
zpe.sumelectthermal: -1220.441419 hartree
zpe.sumelectthermalent: -1220.440475 hartree
zpe.sumelectthermalfe: -1220.514912 hartree
dipole: 0.7852 -7.0104 1.4755
dipole: 7.2069
quadrupole: -128.9609 -164.9291 -139.0419
quadrupole: -23.8972 3.3351 0.0278
quadrupole: 15.3498 -20.6185 5.2687 -23.8972 3.3351 0.0278
hfenergy: -1220.7847678 hartree
pointgroup: C01 [X(C16H18O8)]
dipole: -0.145273 2.5814729 1.1637749 debye
polarizability: 295.4057195|23.968654|206.7913192|-10.6543308|36.4819128|136.3431628 unknown
InChI: InChI=1S/C16H18O8/c1-7-4-12(18)23-10-5-8(2-3-9(7)10)22-16-15(21)14(20)13(19)11(6-17)24-16/h2-5,11,13-17,19-21H,6H2,1H3
charge 0 multiplicity 1
42 atoms
O  2.063807 -0.649988 0.546154
O  0.970477 1.424876 0.539991
O  5.564252 1.057443 -1.039001
O  5.186069 -1.864725 -1.088839
O  3.752094 1.750885 0.952449
O  1.596443 -3.464655 0.697701
O  -2.843835 -1.429018 -0.473585
O  -4.625059 -2.800479 -1.00362
C  4.245237 0.416543 -1.030191
C  4.343355 -0.952859 -0.320041
C  3.206236 1.339753 -0.349635
C  2.955091 -1.602446 -0.189548
C  1.868752 0.592877 -0.217379
C  2.940342 -2.893781 0.629687
C  -0.401915 1.096391 0.573772
C  -0.952122 -0.075718 0.021216
C  -1.220731 2.063059 1.21629
C  -3.20897 0.689495 0.734483
C  -2.349567 -0.257618 0.100181
C  -2.602196 1.852346 1.293089
C  -4.642029 0.413258 0.777014
C  -5.12054 -0.749043 0.200703
C  -5.583902 1.390356 1.444716
C  -4.276735 -1.73771 -0.458707
H  3.992603 0.254443 -2.094525
H  4.765025 -0.786348 0.696574
H  3.07041 2.26394 -0.937924
H  2.527077 -1.794863 -1.196676
H  1.44984 0.351925 -1.220837
H  3.56862 -3.646574 0.130396
H  3.34994 -2.69165 1.642833
H  5.66723 1.495625 -0.149754
H  6.020316 -1.374801 -1.313416
H  3.278015 1.263311 1.674494
H  0.997309 -2.790967 1.111382
H  -0.347541 -0.858957 -0.441248
H  -0.750798 2.957738 1.632783
H  -3.228008 2.6011 1.788101
H  -6.187488 -0.987997 0.211959
H  -6.626285 1.03872 1.388174
H  -5.531479 2.386447 0.966376
H  -5.325737 1.526966 2.511708
