program: Gaussian 09
title: 000194256
version: EM64L-G09RevD.01
frameworkgroup: C1[X(C23H27NO2)]
method: RPBEPBE
basis: SDD
operation: Freq
keyword: #p
keyword: freq=noraman
keyword: PBEPBE/SDD
title: #p freq=noraman PBEPBE/SDD
converged: YES YES NO NO
title: Mulliken charges:
elementType: O O N C C C C C C C C C C C C C C C C C C C C C C C H H H H H H H H H H H H H H H H H H H H H H H H H H H
charge: -0.307716 -0.436339 -0.035909 0.227053 -0.108468 -0.191560 -0.489032 -0.506153 -0.467047 0.331886 -0.623185 -0.482867 -0.390333 -0.408575 0.251148 -0.591973 -0.648807 -0.375296 0.297429 -0.427327 0.329371 -0.307478 -0.364060 -0.369730 -0.320748 0.277131 0.212101 0.212232 0.213704 0.209658 0.199467 0.200084 0.187164 0.225754 0.231189 0.250139 0.252627 0.205959 0.210966 0.189847 0.187657 0.199762 0.272267 0.225389 0.225334 0.187983 0.238798 0.256387 0.258985 0.258793 0.220494 0.253480 0.352370
chargesum: 0.00000
title: Mulliken charges with hydrogens summed into heavy atoms:
elementType: O O N C C C C C C C C C C C C C C C C C C C C C C C
charge: -0.307716 -0.083969 -0.035909 0.227053 0.103633 0.020671 -0.065670 -0.106602 -0.054129 0.331886 -0.141858 -0.024282 0.010479 -0.021155 0.251148 -0.319707 -0.010101 -0.136498 0.297429 -0.170941 0.329371 -0.048493 -0.105267 -0.149236 -0.067268 0.277131
polarizability: 3.29552408e+02 1.57183869e+01 2.40140179e+02 2.03316158e+01 1.11108722e+00 1.97026592e+02
1716.lowfreq: -8.3537 -1.1752 -0.0006 -0.0003 0.0003 16.1496 22.6702 35.9547 46.4180
frequency: 21.4547 35.5376 44.0413 69.5696 90.5980 110.5686 118.4864 143.3593 165.3182 197.2372 213.4087 227.9675 240.2678 253.8618 268.7512 284.1427 317.4552 324.9780 334.1906 337.7523 349.3430 368.2189 395.1155 400.2449 415.5622 417.7601 424.6739 447.8313 454.2219 484.5552 493.3538 498.8483 507.3884 521.8090 537.7582 557.1424 578.5300 627.7056 632.2547 671.3300 690.0585 710.6419 715.4461 738.4428 756.8596 775.8562 791.0809 796.7180 816.5961 824.4755 830.8990 831.9356 851.0295 861.0112 884.8929 890.6653 908.8017 925.0725 930.8217 933.7216 951.0497 954.3307 961.1413 978.1942 992.6673 997.8947 1021.4430 1036.4074 1045.4510 1058.0176 1087.2937 1090.2500 1094.1848 1097.3334 1107.1349 1111.1472 1131.6796 1139.8615 1142.4360 1146.0009 1152.0992 1164.7312 1166.4942 1177.5783 1191.3475 1198.8947 1213.9520 1220.1104 1240.3262 1247.7533 1250.5021 1262.4882 1265.7130 1286.4585 1295.6498 1301.7756 1307.1041 1319.7562 1327.9111 1332.7447 1339.4902 1342.0699 1344.5659 1351.4280 1361.4631 1368.4756 1374.4695 1390.7705 1408.7936 1428.1412 1429.8249 1444.3518 1446.3249 1461.3205 1461.6336 1466.9042 1469.7300 1471.3953 1480.9408 1488.8720 1489.1574 1494.0309 1585.1692 1605.0063 1608.1536 1624.1268 2866.4083 2949.0384 2958.5687 2961.8792 2965.8663 2968.8006 2970.3063 2975.2276 2990.6783 2993.7209 3008.8605 3019.2370 3021.6735 3025.1521 3026.8838 3028.4840 3040.3447 3051.0123 3067.5230 3117.0330 3118.4914 3154.4885 3159.6868 3161.8010 3167.8508 3180.2108 3586.3174
redmass: 5.9195 3.9986 4.5671 4.7080 4.1658 2.9070 4.6848 3.4993 2.7779 2.8098 1.2472 3.9396 3.2247 2.9090 2.8602 2.3868 4.6751 2.6198 1.1200 2.8874 5.8960 2.9873 3.5870 3.5645 3.3134 3.6043 3.0558 2.3021 2.8205 2.4339 2.8777 3.2832 4.7676 3.6580 2.5292 4.4454 3.0481 3.6662 6.7697 5.2785 4.2678 3.1567 4.1662 3.4298 4.6336 2.2574 2.7217 1.3359 2.2834 1.8969 1.9380 1.7368 2.2565 2.6283 2.4094 1.5813 1.7986 1.4313 2.0961 2.3354 1.3418 1.4635 2.5075 2.0305 2.0031 2.7271 2.2007 2.0981 1.8845 2.3046 2.1014 1.7540 1.3470 1.8600 1.9313 1.4341 2.2748 1.4285 1.3990 1.7333 1.7820 1.2857 1.5220 1.4780 1.8741 2.0375 1.9269 2.7959 1.9293 1.4054 3.0173 1.4330 1.5645 1.6556 1.4410 1.5339 1.3269 1.3229 1.3820 1.5933 1.4212 1.5056 1.3220 1.4120 1.4983 1.7467 2.8246 6.2503 3.7324 1.1777 3.0814 1.1376 1.0895 1.0696 1.0997 1.0881 1.0842 1.0996 1.5542 1.2592 1.3189 2.1702 7.6516 7.2386 6.4609 6.5171 1.0556 1.0811 1.0610 1.0610 1.0656 1.0621 1.0620 1.0632 1.0707 1.0751 1.0732 1.0984 1.0971 1.0967 1.0968 1.1010 1.1030 1.1041 1.1005 1.0898 1.0895 1.0899 1.0884 1.0942 1.0951 1.0975 1.0661
irintensity: 0.8430 0.6588 0.3803 1.0876 0.6788 0.3845 0.7312 0.0160 0.2346 4.2472 0.4710 0.9558 0.3223 0.0221 0.6122 0.4486 1.1012 0.7613 139.9273 1.7714 1.9755 0.6569 6.2564 11.5338 3.8668 5.8951 0.1521 0.9873 7.4211 2.7424 19.1922 23.3837 1.0691 5.1617 3.9951 5.2633 2.4352 14.8430 0.8631 0.6271 1.3408 2.6200 10.0676 1.3540 27.6637 3.6830 4.0416 23.6005 25.5958 36.7645 4.3531 32.9158 8.7007 29.9447 8.7433 13.9105 17.9117 3.6592 16.3172 5.0605 0.1404 1.7690 13.6351 0.5773 3.8678 8.7801 26.5576 17.3651 5.8600 2.0780 1.7358 9.9536 52.0668 7.0495 10.4846 13.1441 3.1050 78.5013 179.3780 11.6999 25.6460 10.3239 2.0882 0.8241 53.2724 187.0183 4.4251 140.4208 4.2074 2.4767 18.2777 7.0104 33.7716 6.8560 4.4717 22.7358 3.1141 2.1719 0.7745 2.2860 1.6732 3.5547 0.5247 0.3342 4.8921 13.5341 3.3372 16.0153 6.4337 6.2928 51.9851 27.7621 0.5928 36.4310 2.1412 6.8296 16.3603 11.1599 145.6810 129.8052 136.1079 26.8661 12.6804 5.3628 54.9937 4.4778 94.5126 14.8214 22.9635 34.3366 9.6742 65.4795 41.9290 26.3867 69.9625 33.5678 73.9014 41.2884 65.7560 37.3148 7.5794 32.2983 113.7655 64.2002 36.1860 21.6659 18.0217 7.8366 5.6295 5.5341 7.7965 4.1235 41.3576
temp: 298.150 k
press: 1.00000 atm
elementType: 8 8 7 6 6 6 6 6 6 6 6 6 6 6 6 6 6 6 6 6 6 6 6 6 6 6 1 1 1 1 1 1 1 1 1 1 1 1 1 1 1 1 1 1 1 1 1 1 1 1 1 1 1
symmnumber: 1
zpe: 1174655.6 jmol-1
zpe.correction: 0.447403 hartree
zpe.thermalcorrener: 0.469487 hartree
zpe.thermalcorrenthalpy: 0.470431 hartree
zpe.thermalcorrgfe: 0.397158 hartree
zpe.sumelectzpe: -1095.921797 hartree
zpe.sumelectthermal: -1095.899713 hartree
zpe.sumelectthermalent: -1095.898769 hartree
zpe.sumelectthermalfe: -1095.972042 hartree
dipole: -1.5653 3.0581 -0.9652
dipole: 3.5684
quadrupole: -159.7245 -149.6930 -150.8714
quadrupole: 4.0369 -4.1134 -2.5384
quadrupole: -6.2949 3.7366 2.5583 4.0369 -4.1134 -2.5384
hfenergy: -1096.3691998 hartree
pointgroup: C01 [X(C23H27N1O2)]
dipole: -0.6105149 -1.1846818 0.4413491 debye
polarizability: 329.1565048|-16.5910762|240.1283811|-20.9450847|-0.728625|197.434293 unknown
InChI: InChI=1S/C23H27NO2/c1-24-13-12-23-11-3-2-4-20(23)22(24)14-16-5-8-19(15-21(16)23)26-18-9-6-17(25)7-10-18/h5-10,15,20,22,25H,2-4,11-14H2,1H3
charge 0 multiplicity 1
53 atoms
O  2.409498 2.026734 -0.055674
O  6.495989 -1.834652 -0.475634
N  -4.455876 0.465058 -0.826632
C  -1.752105 -0.806929 -0.548252
C  -2.955064 -1.189495 0.373164
C  -3.901826 0.040941 0.497308
C  -2.332763 -0.386381 -1.94396
C  -0.85661 -2.068006 -0.724105
C  -2.490172 -1.763237 1.733295
C  -0.996783 0.400078 0.049162
C  -3.168372 1.213413 1.192912
C  -3.380681 0.75106 -1.817357
C  -0.376243 -2.660061 0.620866
C  -1.576998 -2.998237 1.53716
C  -1.696496 1.374667 0.821664
C  0.37675 0.608131 -0.233665
C  -5.517588 -0.425852 -1.33827
C  -1.000207 2.521588 1.280289
C  1.050337 1.746232 0.254372
C  0.367113 2.721067 1.010358
C  3.359261 0.976347 -0.149222
C  3.350185 -0.150106 0.704501
C  4.404765 1.159057 -1.083035
C  4.386802 -1.104366 0.609558
C  5.442723 0.21152 -1.172319
C  5.431396 -0.923532 -0.328545
H  -3.512975 -1.996597 -0.150396
H  -4.774054 -0.233825 1.124258
H  -2.798453 -1.279237 -2.410006
H  -1.508084 -0.061892 -2.609497
H  0.004265 -1.854732 -1.386859
H  -1.463103 -2.832961 -1.253068
H  -3.376539 -2.035146 2.341851
H  -1.934593 -0.991653 2.30155
H  -3.237148 1.068354 2.290187
H  -3.725235 2.142804 0.967639
H  -2.871178 1.685531 -1.518184
H  -3.856489 0.943781 -2.79683
H  0.283225 -1.931315 1.133036
H  0.230938 -3.567774 0.436443
H  -2.165428 -3.819339 1.076907
H  -1.220122 -3.369954 2.517564
H  0.931129 -0.113325 -0.840853
H  -5.9656 0.028228 -2.241032
H  -6.31404 -0.516961 -0.576944
H  -5.189674 -1.459666 -1.609669
H  -1.544605 3.272781 1.866018
H  0.906319 3.604224 1.36483
H  2.550179 -0.279555 1.439773
H  4.393292 2.045394 -1.72392
H  4.379603 -1.97856 1.273603
H  6.26225 0.332999 -1.886265
H  6.407787 -2.583744 0.164024
