program: Gaussian 09
title: 000194234
version: EM64L-G09RevD.01
frameworkgroup: C1[X(C10H9ClN2O2S)]
method: RPBEPBE
basis: SDD
operation: Freq
keyword: #p
keyword: freq=noraman
keyword: PBEPBE/SDD
title: #p freq=noraman PBEPBE/SDD
converged: NO YES NO NO
title: Mulliken charges:
elementType: Cl S O O N N C C C C C C C C C C H H H H H H H H H
charge: -0.011248 0.253656 -0.160489 -0.272516 -0.431591 0.078802 0.020761 -0.398858 -0.697143 -0.228187 0.182045 0.262892 -0.257435 -0.449930 -0.144116 -0.254995 0.284753 0.236270 0.289306 0.282581 0.282406 0.337547 0.237563 0.292719 0.265206
chargesum: 0.00000
title: Mulliken charges with hydrogens summed into heavy atoms:
elementType: Cl S O O N N C C C C C C C C C C
charge: -0.011248 0.253656 -0.160489 -0.272516 -0.094043 0.078802 0.305514 0.126718 -0.132156 -0.228187 0.182045 0.262892 -0.019871 -0.157212 0.121090 -0.254995
polarizability: 2.45645352e+02 1.52562210e+01 1.47203948e+02 -6.42872761e-01 6.71606462e-01 7.37531114e+01
1716.lowfreq: -6.0525 -0.0023 -0.0009 0.0013 1.1722 7.4025 24.7382 33.8769 51.3302
frequency: 24.7135 33.8670 51.3168 60.1559 85.7432 125.3738 158.8350 190.5546 203.3325 265.7752 272.4695 302.9099 382.9177 392.3256 407.0508 408.8114 465.0678 471.1408 500.6105 545.0254 560.7643 605.1959 612.1992 628.4020 682.1543 703.4214 744.8553 757.8173 834.4685 842.7206 870.2040 898.0760 955.7430 965.7597 985.2104 987.3349 1008.6795 1049.1881 1075.8944 1104.1514 1122.5866 1151.1103 1163.3158 1188.4693 1228.8064 1271.8650 1273.2148 1289.0786 1301.6312 1326.3597 1341.4441 1352.1678 1435.2234 1455.2059 1465.4990 1490.2604 1533.1823 1574.1432 1588.6888 1638.7779 2947.5742 3025.5130 3047.9544 3101.9378 3133.3820 3135.8902 3167.9435 3187.1719 3518.8390
redmass: 5.1248 7.6946 9.2347 5.9140 10.6153 5.9791 5.9547 10.5912 2.4289 6.2562 7.3057 9.4536 3.8795 8.0156 9.1449 3.5667 6.3884 4.3312 5.1690 2.0801 2.4771 3.5034 7.5702 4.1641 6.1187 6.4845 6.8766 3.9773 1.5219 1.5384 5.0856 3.7954 1.4697 1.3716 2.3793 3.5517 1.6047 2.0873 4.6586 2.5693 1.6711 1.4859 1.3658 3.2195 1.4039 1.3841 1.3521 1.4888 1.7498 11.2968 1.4132 2.1782 2.2122 1.0860 1.0899 2.3066 7.2585 5.6974 8.0346 11.0748 1.0808 1.0614 1.0594 1.1029 1.1085 1.0915 1.0929 1.0965 1.0773
irintensity: 3.4808 1.2624 2.9013 8.1167 5.0227 0.0376 18.1160 0.3579 1.8392 3.5937 5.2027 0.7247 6.3548 7.5913 4.5373 10.3364 6.4572 23.6264 21.0730 44.8263 36.6969 22.1803 4.7511 5.8732 2.5794 13.8037 38.4202 23.1166 31.7416 17.2946 12.9437 88.6598 7.5190 0.7280 34.9057 18.9188 4.5648 20.0689 49.7804 123.4756 2.7251 14.5676 4.6529 0.5691 2.5747 30.0363 24.3569 18.1740 85.8843 6.0291 0.8590 31.9501 248.8630 11.1538 8.2685 335.2211 30.9691 137.1967 187.3255 214.5609 18.5335 12.2157 19.1300 4.9927 8.7451 7.7228 1.0535 1.2150 48.6216
temp: 298.150 k
press: 1.00000 atm
elementType: 17 16 8 8 7 7 6 6 6 6 6 6 6 6 6 6 1 1 1 1 1 1 1 1 1
symmnumber: 1
zpe: 464614.5 jmol-1
zpe.correction: 0.176962 hartree
zpe.thermalcorrener: 0.191703 hartree
zpe.thermalcorrenthalpy: 0.192647 hartree
zpe.thermalcorrgfe: 0.132340 hartree
zpe.sumelectzpe: -1503.395509 hartree
zpe.sumelectthermal: -1503.380768 hartree
zpe.sumelectthermalent: -1503.379824 hartree
zpe.sumelectthermalfe: -1503.440132 hartree
dipole: 3.5281 -0.5034 1.0543
dipole: 3.7165
quadrupole: -118.9064 -113.4175 -107.1131
quadrupole: 20.9994 2.9497 1.9697
quadrupole: -5.7607 -0.2718 6.0326 20.9994 2.9497 1.9697
hfenergy: -1503.5724715 hartree
pointgroup: C01 [X(C10H9Cl1N2O2S1)]
dipole: 1.3838839 0.1830385 -0.4351926 debye
dipolederiv: -1.0389998 0.2524498 -0.0555816 0.2215989 -0.1633999 0.0108863 -0.0773891 0.0194319 -0.0785125 -0.7717311 0.2972907 0.1688266 0.1262188 -0.1737338 -0.0509459 0.1645713 -0.0843439 -0.107784 -0.8254938 0.262416 0.1398319 0.4382048 -0.9701219 -0.2123675 0.1037615 -0.1114507 -0.302238 -0.8513041 0.1663968 -0.0279755 -0.0877972 -0.8202554 0.1851899 0.0762568 0.1325599 -0.3999005 -1.3221296 -0.2199332 0.1415602 -0.605865 -0.5263722 0.0679443 0.2654751 0.0499352 -0.453342 -0.710653 0.0858744 -0.0270313 0.5536985 -0.5903646 0.0199176 -0.0238826 -0.0133185 -0.1729931 0.51396 -0.0752189 0.0358959 -0.2296572 -0.1127556 -0.0033566 0.1119541 0.049246 0.3175021 -0.1989963 -0.0242477 0.0183036 -0.0720086 -0.1116181 -0.0761548 0.0263751 -0.0095618 0.0834221 0.0059769 0.0294603 0.0044735 0.0475738 0.4066081 0.0201854 0.0779724 0.0143321 0.1200371 1.5182372 -0.3767672 -0.3648229 -0.4713293 1.019651 0.2214674 -0.406397 0.1269444 0.1467863 1.9386829 0.0096213 -0.0802563 0.4309547 1.042604 -0.3357624 -0.2038936 -0.2271265 0.3247795 -0.5388487 0.0002307 -0.0286309 0.2004874 -0.2716422 0.0225021 -0.0876375 0.0153957 0.0153455 0.2228746 -0.0072094 0.031637 -0.2027113 0.1494932 0.0052677 0.080164 0.0071192 -0.0923806 0.3272824 0.0464766 0.0278963 -0.0437373 0.3221525 0.0111688 -0.0062435 0.0110107 -0.028897 -0.6948759 0.0776325 -0.0393913 -0.1760977 0.0304528 -0.0016614 -0.0428889 0.0099087 -0.0719762 1.721826 -0.3938463 0.1104561 -0.414066 0.4817579 -0.0112255 0.1379251 -0.0139785 0.0200457 -0.0437401 -0.0189616 -0.0090915 0.0681418 0.0638166 0.0395989 -0.0833453 -0.0148497 -0.0380031 0.0609973 0.0246619 -0.0368359 0.0373659 0.0683034 0.0790588 -0.0420263 0.0173104 -0.0852468 0.136919 -0.1025886 -0.0186394 -0.0612299 -0.0056811 0.0010245 -0.0519733 0.0131258 0.103198 0.0645655 -0.0336741 -0.0265967 0.0207948 -0.059795 0.0550501 -0.0812871 0.0725468 -0.0383786 0.0045523 0.0149074 0.0651277 0.0341552 0.0127173 -0.0509362 0.0843427 -0.0648034 0.0115321 0.2922051 0.0030101 -0.0041321 0.1915408 0.1526506 0.0276056 -0.0037883 0.0154748 0.2928248 -0.0018166 -0.0955273 -0.0175903 -0.1043594 0.0396125 -0.0113546 -0.0309734 -0.0050166 0.1358686 0.1161667 0.0406206 -0.0013274 0.0525295 0.0325682 -0.0066198 0.0230982 -0.0012609 0.1321436 0.0743431 0.0369249 -0.0061056 0.0455941 -0.0166485 -0.0064829 -0.0101704 -0.0086313 0.1661668 unknown
polarizability: 244.9303039|-17.1908358|147.7450457|-3.1058383|3.3459724|73.9270619 unknown
InChI: InChI=1S/C10H9ClN2O2S/c11-8-2-1-6(5-12-8)9(14)13-7-3-4-16-10(7)15/h1-2,5,7,13H,3-4H2
charge 0 multiplicity 1
25 atoms
Cl -5.857911 0.738267 -0.269716
S  4.993431 0.731295 -0.401865
O  2.794739 2.267608 0.239903
O  0.2915 -1.97076 0.497539
N  1.010328 0.153775 -0.089102
N  -3.747757 -0.959319 -0.158417
C  2.41675 -0.177719 0.124996
C  3.049023 -1.177117 -0.870513
C  4.570581 -1.118239 -0.628553
C  3.249122 1.120482 0.052198
C  0.015211 -0.769511 0.178081
C  -1.405307 -0.288854 0.057891
C  -1.802242 1.075413 0.088401
C  -2.424191 -1.268767 -0.057807
C  -3.168513 1.407283 -0.009779
C  -4.084266 0.33872 -0.136136
H  2.536473 -0.600934 1.147435
H  2.80933 -0.869287 -1.904287
H  2.652176 -2.190926 -0.699795
H  4.870376 -1.645026 0.291294
H  5.158498 -1.485908 -1.481567
H  0.798756 1.131188 -0.307907
H  -1.075114 1.885214 0.216722
H  -2.158703 -2.329962 -0.062073
H  -3.512588 2.443285 0.018855
