program: Gaussian 09
title: 000194215
version: EM64L-G09RevD.01
frameworkgroup: C1[X(C15H19NO3)]
method: RPBEPBE
basis: SDD
operation: Freq
keyword: #p
keyword: freq=noraman
keyword: PBEPBE/SDD
title: #p freq=noraman PBEPBE/SDD
converged: YES YES NO NO
title: Mulliken charges:
elementType: O O O N C C C C C C C C C C C C C C C H H H H H H H H H H H H H H H H H H H
charge: -0.216257 -0.262283 -0.216346 -0.158959 -0.109095 -0.191003 -0.074950 0.176180 -0.570750 0.198941 -0.716793 -0.716583 -0.631164 0.501801 -0.455232 -0.397835 -0.218381 -0.235574 -0.242378 0.247220 0.267177 0.237530 0.237046 0.242820 0.241594 0.220275 0.202341 0.233264 0.212236 0.239961 0.230968 0.239351 0.282365 0.228277 0.284968 0.227762 0.230420 0.231084
chargesum: 0.00000
title: Mulliken charges with hydrogens summed into heavy atoms:
elementType: O O O N C C C C C C C C C C C C C C C
charge: -0.216257 -0.262283 -0.216346 -0.158959 0.138125 0.076174 0.162580 0.176180 -0.090883 0.198941 -0.052582 -0.031123 0.121520 0.501801 -0.226954 -0.112867 0.009381 -0.005154 -0.011293
polarizability: 2.34195455e+02 5.43813553e+00 1.54568833e+02 1.14192216e+01 1.76406995e+01 1.29091153e+02
1716.lowfreq: -6.6705 -0.0008 -0.0007 -0.0006 1.1394 9.8427 16.1119 35.3991 40.9383
frequency: 16.0538 35.1320 40.9024 62.2431 75.2543 98.5377 120.8562 136.7600 155.6604 164.0466 177.8441 205.0861 218.3772 235.9931 248.6102 286.3789 309.5890 341.7293 366.8581 396.9997 405.0121 412.5991 426.1180 438.2001 486.1070 534.0414 561.0564 577.3079 613.6852 625.8430 683.2002 708.7343 748.8884 764.6021 787.6187 807.3874 826.6418 845.8184 860.8955 911.9286 920.4604 925.8824 947.0154 962.1242 977.5106 983.9300 989.4649 992.9953 1004.6387 1025.0552 1031.0455 1078.5871 1089.4125 1112.3028 1122.8757 1134.8409 1156.5778 1174.0220 1193.9780 1198.0451 1209.7940 1217.3761 1222.1181 1252.3124 1273.3363 1278.7725 1290.5837 1316.1508 1317.6827 1341.6979 1345.6575 1381.6790 1381.7780 1400.6537 1405.8681 1432.3539 1441.4923 1457.0957 1467.5760 1474.2024 1483.4178 1485.9630 1486.7741 1487.8958 1493.3495 1592.3320 1604.8351 1615.5124 1658.8088 2967.4850 2975.0322 2977.4112 2978.2051 2990.0100 3010.9918 3040.5909 3051.3288 3059.9902 3069.4983 3084.0332 3090.0667 3095.5292 3113.2661 3118.5969 3126.8869 3137.2000 3147.4317 3163.9384
redmass: 4.5550 3.9552 4.0915 4.3719 3.6891 4.5068 6.6054 3.6473 1.3094 2.0520 4.7054 1.0777 3.1378 1.6908 1.7001 2.8768 2.8418 3.8388 4.9814 3.8563 2.8687 7.1354 3.4099 6.4336 3.4029 4.0682 4.4688 5.1870 5.7204 4.7742 4.9226 2.0137 1.6766 6.1494 3.9877 4.0102 3.0180 3.9782 1.2521 1.7724 2.6973 1.1875 2.0419 1.5981 2.7246 1.4062 5.1223 3.4189 1.4245 2.1753 2.2198 1.9757 1.6408 1.8568 1.4356 2.3018 1.8220 1.0617 1.8949 1.1996 2.5553 2.1729 1.7331 1.3204 1.3509 1.4478 1.8766 1.4652 1.7340 1.4385 1.2809 1.4282 3.6275 1.2099 1.4187 1.5503 2.0122 1.1270 1.0430 1.0521 1.1404 1.0517 1.0921 2.1886 1.0562 5.9025 8.5294 5.8967 10.9829 1.0804 1.0657 1.0372 1.0354 1.0357 1.0837 1.0968 1.0870 1.1009 1.0980 1.0997 1.0999 1.1002 1.0876 1.0989 1.0866 1.0918 1.0961 1.1016
irintensity: 0.1761 0.0222 2.4550 2.2939 0.1414 0.3163 3.8829 0.1407 1.0485 1.8196 3.0351 0.5136 3.2914 3.4650 2.0330 0.5229 1.9285 0.8156 15.6433 9.3120 0.3006 7.1447 6.3015 2.7067 16.2797 2.5400 7.2875 1.0337 0.4113 8.0626 0.2300 39.1483 58.3556 8.8469 2.3680 1.4190 3.6428 2.3740 0.2979 11.1342 37.5530 8.2361 18.8224 13.5057 81.7441 1.6948 2.6200 1.7158 2.7027 14.0144 26.6955 2.6897 11.2574 39.4382 4.4185 50.7781 76.4163 3.4598 11.3498 14.3985 115.7081 52.9245 15.5285 3.0924 15.9549 11.3802 44.8956 8.3495 3.6305 0.8968 12.3656 20.2627 4.6559 23.1531 23.9799 55.2465 14.2068 8.9327 4.6662 5.4897 19.3213 8.1353 19.1746 33.5004 18.0049 4.9634 313.7951 1.4524 255.4249 20.6879 14.4594 49.3345 31.8747 20.0721 5.7189 11.5379 9.6061 22.9053 38.8011 18.8541 39.8366 30.6341 9.6134 0.9550 2.9336 13.7666 17.6531 34.6086
temp: 298.150 k
press: 1.00000 atm
elementType: 8 8 8 7 6 6 6 6 6 6 6 6 6 6 6 6 6 6 6 1 1 1 1 1 1 1 1 1 1 1 1 1 1 1 1 1 1 1
symmnumber: 1
zpe: 817970.1 jmol-1
zpe.correction: 0.311548 hartree
zpe.thermalcorrener: 0.330448 hartree
zpe.thermalcorrenthalpy: 0.331392 hartree
zpe.thermalcorrgfe: 0.262862 hartree
zpe.sumelectzpe: -862.005633 hartree
zpe.sumelectthermal: -861.986733 hartree
zpe.sumelectthermalent: -861.985789 hartree
zpe.sumelectthermalfe: -862.054319 hartree
dipole: -2.2043 1.9712 1.3412
dipole: 3.2471
quadrupole: -109.5117 -121.5442 -112.1507
quadrupole: -8.5199 1.3175 -4.6304
quadrupole: 4.8905 -7.1420 2.2516 -8.5199 1.3175 -4.6304
hfenergy: -862.3171813 hartree
pointgroup: C01 [X(C15H19N1O3)]
dipole: 0.8214213 0.7939468 -0.5717725 debye
polarizability: 234.264501|0.8256319|151.8793001|13.7083493|-18.3515412|131.711639 unknown
InChI: InChI=1S/C15H19NO3/c1-10(2)13-14(17)16(3)12(15(18)19-13)9-11-7-5-4-6-8-11/h4-8,10,12-13H,9H2,1-3H3
charge 0 multiplicity 1
38 atoms
O  -1.769624 -1.34392 0.337112
O  -3.060815 2.005489 -0.379653
O  0.045557 -1.926953 1.589735
N  -1.002412 1.347252 0.510902
C  -2.417738 -0.354083 -0.590052
C  0.064215 0.321618 0.59762
C  -3.906597 -0.745963 -0.693223
C  -2.200176 1.105269 -0.140001
C  0.973412 0.302292 -0.692293
C  -0.528691 -1.064174 0.896805
C  -4.053483 -2.120353 -1.384692
C  -4.607179 -0.719768 0.684724
C  -0.66749 2.708718 0.965024
C  2.468305 0.137693 -0.431331
C  3.390564 0.97165 -1.114515
C  2.969752 -0.845219 0.462846
C  4.78261 0.828893 -0.916954
C  4.361603 -0.984868 0.663096
C  5.273583 -0.152156 -0.025555
H  -1.936852 -0.489343 -1.582284
H  0.699752 0.579972 1.462301
H  -4.363739 0.037083 -1.329255
H  0.801342 1.257631 -1.222089
H  0.621961 -0.497784 -1.374887
H  -3.563694 -2.912403 -0.79119
H  -5.121444 -2.381397 -1.491698
H  -3.603366 -2.119201 -2.396046
H  -4.155435 -1.45928 1.369081
H  -5.676768 -0.969461 0.56635
H  -4.545008 0.280909 1.146994
H  0.216306 3.100022 0.426202
H  -0.452828 2.710493 2.049017
H  -1.53131 3.358918 0.757631
H  3.01768 1.737569 -1.806729
H  2.277242 -1.499982 1.00401
H  5.479615 1.482016 -1.454079
H  4.733049 -1.748208 1.356054
H  6.352099 -0.265169 0.131017
