program: Gaussian 09
title: 000194207
version: EM64L-G09RevD.01
frameworkgroup: C1[X(C8H18N2O)]
method: RPBEPBE
basis: SDD
operation: Freq
keyword: #p
keyword: freq=noraman
keyword: PBEPBE/SDD
title: #p freq=noraman PBEPBE/SDD
converged: YES YES NO NO
title: Mulliken charges:
elementType: O N N C C C C C C C C H H H H H H H H H H H H H H H H H H
charge: -0.276960 -0.364723 -0.545909 -0.349260 -0.353652 -0.367548 -0.394879 -0.412746 0.254045 -0.500355 -0.665833 0.198812 0.183947 0.183899 0.228256 0.193114 0.184229 0.249773 0.213960 0.205194 0.209009 0.290171 0.199217 0.236481 0.262108 0.259764 0.213492 0.212246 0.254149
chargesum: 0.00000
title: Mulliken charges with hydrogens summed into heavy atoms:
elementType: O N N C C C C C C C C
charge: -0.276960 -0.074553 -0.024038 0.033499 0.058503 0.009795 0.068854 0.001457 0.254045 -0.064657 0.014054
polarizability: 1.32949550e+02 -4.25826932e+00 9.21074043e+01 -5.39044330e-01 4.43083651e+00 9.15311372e+01
1716.lowfreq: -12.7553 -2.3417 -0.0006 0.0004 0.0005 6.6396 20.2198 33.8748 44.3518
frequency: 20.1051 33.7798 44.0472 60.6251 65.1930 111.2248 125.1450 137.7102 202.3417 226.1511 244.1640 269.7474 277.3730 306.5082 408.0894 435.4851 487.5332 548.8697 597.1032 611.9660 675.5390 726.8070 745.4933 790.7302 794.7226 858.2624 933.2823 975.5561 990.5511 1016.5919 1021.8893 1048.7425 1067.3046 1071.9714 1077.4305 1098.2650 1103.6001 1158.5394 1208.3882 1227.7492 1231.9474 1264.5424 1276.8180 1285.2302 1294.0723 1303.8148 1332.9884 1334.3163 1346.6981 1352.1302 1369.1713 1386.6186 1446.7189 1450.3765 1455.6342 1463.2045 1470.5341 1471.5662 1482.4202 1487.1480 1490.0068 1619.1046 1643.7991 2950.5957 2955.5599 2971.6679 2979.0672 2980.1896 2990.6024 2991.6629 2993.9009 3011.9033 3033.8263 3037.2431 3046.7141 3072.1332 3086.5418 3103.2571 3449.8566 3555.2515 3575.6805
redmass: 3.5837 4.5379 1.7935 2.8627 2.8371 1.8736 3.0848 2.1577 1.2346 2.3999 3.6148 1.1430 2.5386 3.7787 3.4287 2.4686 2.2873 1.3694 2.8433 1.6102 3.0979 1.0691 1.1690 1.4112 1.3354 1.8660 1.3688 3.8009 3.9206 2.2377 1.2442 1.9315 2.9574 2.8046 2.0778 3.8433 2.5673 1.6925 1.7039 1.3672 1.3728 1.2692 1.2803 1.0422 1.2770 1.1366 1.1803 1.6017 1.3753 1.4672 1.3460 1.1972 1.1205 1.0983 1.0806 1.0726 1.0924 1.0581 1.1697 1.1692 1.4252 6.1107 1.0886 1.0591 1.0592 1.0631 1.0611 1.0586 1.0867 1.0380 1.0703 1.1002 1.1008 1.1009 1.1043 1.1035 1.1007 1.1003 1.0445 1.0777 1.0973
irintensity: 2.2420 6.4127 3.2624 0.1503 0.9571 2.0188 2.6138 0.3569 1.8604 4.4330 1.3488 49.7913 10.9365 15.5434 0.9183 10.8070 42.0646 95.9709 16.1424 307.7300 1.2151 11.1016 0.9155 4.5775 5.8028 3.5619 3.9343 14.7581 6.4280 2.8586 0.8256 12.5987 12.8624 7.7881 1.8152 16.3251 0.1435 4.1684 56.2250 3.0352 34.0669 11.9054 7.1754 0.5590 0.5897 17.5293 0.3545 18.3664 1.6946 4.9081 1.8388 19.3770 26.6880 13.7828 4.0694 0.7613 16.5856 9.6327 25.9196 36.0698 156.6883 143.7224 32.1942 1.9934 32.6373 26.3798 74.4885 34.0888 8.4981 35.4174 51.7761 8.0652 18.5588 2.3922 114.8660 36.1473 45.2253 23.3293 1.4275 12.5044 0.1020
temp: 298.150 k
press: 1.00000 atm
elementType: 8 7 7 6 6 6 6 6 6 6 6 1 1 1 1 1 1 1 1 1 1 1 1 1 1 1 1 1 1
symmnumber: 1
zpe: 674987.5 jmol-1
zpe.correction: 0.257089 hartree
zpe.thermalcorrener: 0.271569 hartree
zpe.thermalcorrenthalpy: 0.272513 hartree
zpe.thermalcorrgfe: 0.213107 hartree
zpe.sumelectzpe: -499.466700 hartree
zpe.sumelectthermal: -499.452220 hartree
zpe.sumelectthermalent: -499.451276 hartree
zpe.sumelectthermalfe: -499.510682 hartree
dipole: -0.7417 -1.1288 -4.0770
dipole: 4.2949
quadrupole: -79.1577 -65.5361 -70.5865
quadrupole: 5.9685 3.8729 0.3642
quadrupole: -7.3976 6.2240 1.1736 5.9685 3.8729 0.3642
hfenergy: -499.7237889 hartree
pointgroup: C01 [X(C8H18N2O1)]
dipole: 0.2695801 0.6307132 -1.5442682 debye
polarizability: 133.1827448|-3.0212747|92.8579974|0.1288357|-4.2458375|90.5473494 unknown
InChI: InChI=1S/C8H18N2O/c1-2-8(11)10-7-5-3-4-6-9/h10H,2-7,9H2,1H3
charge 0 multiplicity 1
29 atoms
O  2.467998 -0.338107 1.355301
N  1.792295 1.114925 -0.32995
N  -5.566148 -1.038374 -0.197336
C  -2.015808 0.584549 0.239121
C  -0.615564 0.359331 -0.37367
C  -3.087325 -0.376388 -0.324953
C  0.442014 1.317496 0.223578
C  -4.494649 -0.147034 0.291722
C  2.722991 0.285432 0.278638
C  4.088092 0.199691 -0.41774
C  4.612601 -1.25214 -0.468443
H  -1.955971 0.4595 1.340426
H  -2.335346 1.633703 0.061609
H  -0.66491 0.493464 -1.474006
H  -0.287869 -0.681643 -0.188401
H  -2.778264 -1.426253 -0.139225
H  -3.153123 -0.257772 -1.427261
H  0.5151 1.147919 1.312715
H  0.141647 2.370272 0.056676
H  -4.808222 0.899194 0.105237
H  -4.432394 -0.259523 1.39189
H  2.031556 1.555509 -1.21934
H  4.045132 0.63719 -1.434366
H  4.794078 0.819775 0.169485
H  -5.431429 -2.024432 0.048932
H  -5.777481 -0.926691 -1.194389
H  3.983891 -1.882463 -1.122766
H  5.649062 -1.283303 -0.848847
H  4.591144 -1.689127 0.544061
