program: Gaussian 09
title: 000194199
version: EM64L-G09RevD.01
frameworkgroup: C1[X(C20H25BrO4)]
method: RPBEPBE
basis: SDD
operation: Freq
keyword: #p
keyword: freq=noraman
keyword: PBEPBE/SDD
title: #p freq=noraman PBEPBE/SDD
converged: NO YES NO NO
title: Mulliken charges:
elementType: Br O O O O C C C C C C C C C C C C C C C C C C C C H H H H H H H H H H H H H H H H H H H H H H H H H
charge: 0.008477 -0.254119 -0.167829 -0.230696 -0.226967 -0.152898 -0.116894 0.249640 -0.085582 -0.094978 -0.560359 -0.256126 -0.543921 -0.485528 0.051120 -0.515993 -0.638721 0.536686 -0.800869 -0.461966 -0.545132 -0.574761 0.178953 0.373841 -0.787633 0.234956 0.230554 0.246404 0.266798 0.255090 0.232486 0.241945 0.238158 0.221854 0.223983 0.222662 0.254258 0.251357 0.221059 0.241347 0.267827 0.229050 0.226728 0.219751 0.229485 0.248404 0.226963 0.258338 0.305308 0.307490
chargesum: 0.00000
title: Mulliken charges with hydrogens summed into heavy atoms:
elementType: Br O O O O C C C C C C C C C C C C C C C C C C C C
charge: 0.008477 -0.254119 -0.167829 -0.230696 -0.226967 0.082058 0.113660 0.249640 0.160822 0.171820 -0.072783 -0.014181 -0.083908 -0.038883 0.051120 -0.010378 -0.176315 0.536686 -0.077265 -0.012730 -0.069766 -0.316422 0.178953 0.373841 -0.174834
polarizability: 2.66387447e+02 1.65166369e+01 2.62131058e+02 -3.54586980e+00 -9.25025815e-01 1.72101561e+02
1716.lowfreq: -15.1606 -8.2422 -0.0005 0.0003 0.0008 1.9464 10.6358 16.4841 26.4061
frequency: 9.0547 15.6382 26.2107 35.4400 39.0970 61.9350 79.5000 111.2899 117.7249 122.4453 147.8045 163.0471 177.5110 183.0924 206.3454 219.4479 228.1224 253.6142 265.1163 269.0575 278.1998 290.8102 316.4784 363.9755 390.9250 408.4982 424.0565 439.5161 456.3309 468.6588 479.7350 496.9345 517.7961 532.1542 544.2396 548.7546 567.7172 610.2557 616.5124 630.6061 650.4476 698.7614 710.9499 729.0862 755.8165 810.0241 821.1019 823.6576 828.2320 855.9144 864.8286 884.7873 894.0460 905.2609 910.3166 943.1942 955.0165 965.7117 975.4407 990.8920 998.6520 1011.3925 1016.0821 1035.4052 1044.0856 1061.8276 1068.8843 1075.6175 1085.4911 1091.1591 1106.3695 1114.2699 1126.0258 1128.0584 1148.2329 1161.8146 1166.0339 1178.4709 1190.1870 1202.3785 1208.7741 1217.3169 1224.7705 1227.1087 1233.0755 1241.1024 1257.6219 1267.7519 1276.0626 1277.8472 1288.5305 1289.5358 1293.7461 1315.8481 1318.8472 1324.1128 1329.2882 1333.9559 1339.4868 1345.8968 1348.8882 1355.8216 1359.2078 1373.2663 1384.2036 1428.3522 1428.6764 1442.1503 1451.6191 1463.9555 1468.1705 1469.1936 1473.7336 1486.3520 1486.9448 1588.6037 1630.8985 1631.7342 1656.5071 2901.8068 2904.4948 2936.4183 2943.8006 2955.4556 2971.6133 2974.9019 2980.4212 2993.7306 2998.2688 3002.3188 3008.4784 3013.6056 3039.0544 3043.3786 3049.6271 3058.7287 3064.1932 3068.1784 3075.6408 3085.7677 3088.2448 3104.5904 3122.8436 3183.9754
redmass: 6.1936 11.4403 11.2458 7.0657 4.1797 5.4142 4.0031 3.0907 5.6756 6.1612 1.8665 2.8793 1.6516 2.6945 3.8767 3.6137 2.9760 3.3638 3.8509 2.8447 3.6892 2.5802 4.0868 3.2784 3.5639 3.7169 3.4590 3.4779 3.2411 4.2444 3.6933 5.7785 2.5873 2.6184 3.9572 2.4062 3.1449 4.7052 3.8439 3.6844 3.8995 3.1522 3.2379 4.7982 2.2893 2.2300 2.0263 1.9557 2.8682 2.5132 2.4780 1.9124 1.8126 2.1982 1.8195 1.8392 3.7065 2.2338 2.3244 2.2467 2.3381 1.9628 2.2762 2.7691 2.0277 2.7175 2.4893 2.0216 1.5707 2.0448 2.5312 1.7280 1.4682 2.3218 1.9172 1.8060 2.2129 1.3686 1.9284 1.3417 1.5482 1.6274 1.5394 1.6895 1.7996 1.6556 1.4001 1.6437 1.4505 1.2626 1.3368 1.4107 1.4614 1.4157 1.4309 1.4113 1.3957 1.3357 1.4852 1.5410 1.9288 1.5318 1.5171 1.5065 1.1868 1.0877 1.1048 1.0821 1.0888 1.0724 1.0859 1.0884 1.0758 1.0702 1.0674 9.9366 8.2980 9.8429 12.1381 1.0792 1.0806 1.0812 1.0671 1.0831 1.0675 1.0629 1.0617 1.0577 1.0455 1.0568 1.0652 1.0820 1.0962 1.0976 1.0993 1.0990 1.0988 1.0950 1.1022 1.0560 1.0987 1.0996 1.0913 1.1121
irintensity: 0.6323 0.0382 1.0233 3.8275 0.3506 4.1409 2.0175 1.7115 3.4872 0.8277 1.2460 0.3067 0.2818 2.9495 2.1490 2.1184 0.2618 0.4834 4.8302 2.6560 1.3752 0.8322 1.3496 1.5327 3.8711 9.0362 1.3252 5.7552 1.8022 3.6678 6.4384 9.7067 0.6639 0.8996 9.4427 3.6241 4.9312 8.5830 4.1231 6.1304 7.3478 5.8680 4.4446 0.2503 4.9002 2.7017 4.8860 2.0045 3.7774 0.5639 5.0301 8.3297 18.9535 5.4542 21.2649 16.8555 131.7493 21.3176 29.5037 5.9340 33.4003 16.0436 5.1225 23.4688 6.5851 1.6517 4.8247 4.7097 140.7784 13.9225 0.5405 10.1825 19.3512 3.4525 2.3707 1.9785 0.4509 15.7027 5.2616 0.9619 15.6222 27.7507 143.5009 21.0549 170.5226 10.3744 3.4232 50.6032 0.7866 12.4185 0.3715 1.4395 2.8756 0.7660 7.9854 4.0238 0.0966 0.9979 8.8866 5.7290 5.6061 4.6527 0.2373 6.5407 23.4062 19.9817 23.5914 14.1260 14.4377 7.5548 4.8981 5.6277 5.0650 10.3571 12.7445 174.2565 113.6611 245.3625 183.1303 13.4157 7.9408 2.4979 15.0639 28.3634 11.1305 36.4629 39.7127 4.0656 12.9999 34.3384 15.1396 13.5553 46.9538 29.7461 37.3196 7.6811 18.3556 16.9636 32.1394 4.2240 26.8463 11.5986 9.8381 0.4301
temp: 298.150 k
press: 1.00000 atm
elementType: 35 8 8 8 8 6 6 6 6 6 6 6 6 6 6 6 6 6 6 6 6 6 6 6 6 1 1 1 1 1 1 1 1 1 1 1 1 1 1 1 1 1 1 1 1 1 1 1 1 1
symmnumber: 1
zpe: 1077871.7 jmol-1
zpe.correction: 0.410540 hartree
zpe.thermalcorrener: 0.434431 hartree
zpe.thermalcorrenthalpy: 0.435375 hartree
zpe.thermalcorrgfe: 0.353187 hartree
zpe.sumelectzpe: -1089.601802 hartree
zpe.sumelectthermal: -1089.577911 hartree
zpe.sumelectthermalent: -1089.576967 hartree
zpe.sumelectthermalfe: -1089.659155 hartree
dipole: -0.0392 5.5816 -3.4088
dipole: 6.5403
quadrupole: -193.8448 -162.6627 -161.2489
quadrupole: -26.6939 4.5580 2.1075
quadrupole: -21.2593 9.9228 11.3366 -26.6939 4.5580 2.1075
hfenergy: -1090.0123417 hartree
pointgroup: C01 [X(C20H25Br1O4)]
dipole: 0.8185092 2.1746551 -1.1054657 debye
polarizability: 277.3502852|10.4703388|248.9073065|-8.4797652|10.5593083|174.3624749 unknown
InChI: InChI=1S/C20H25BrO4/c1-20-16(6-7-17(20)23)14-4-2-11-8-12(22)3-5-13(11)15(14)9-18(20)25-19(24)10-21/h8,13-16,18H,2-7,9-10H2,1H3
charge 0 multiplicity 1
50 atoms
Br 3.19074 -4.52137 -1.612738
O  2.617466 -1.330587 -0.432264
O  4.303968 1.118718 0.546644
O  -6.275906 -1.218079 0.741061
O  2.560181 -2.609187 1.524927
C  0.861671 2.002509 0.206792
C  -0.540202 1.671444 -0.337327
C  1.965811 1.045052 -0.350799
C  -0.899683 0.211913 0.089075
C  1.624984 -0.368921 0.143197
C  0.210407 -0.808607 -0.296861
C  -2.292749 -0.235438 -0.472498
C  1.470382 3.418515 0.016537
C  -1.623494 2.647122 0.168828
C  3.237306 1.698134 0.238109
C  2.963784 3.210862 0.401105
C  -3.009138 2.26414 -0.403429
C  -3.370352 0.80869 -0.167572
C  2.133694 1.098286 -1.899538
C  -2.690363 -1.639989 0.056024
C  -4.163364 -1.996639 -0.231557
C  -4.629537 0.460695 0.249583
C  -5.11525 -0.933867 0.314567
C  3.006909 -2.389467 0.376182
C  4.062313 -3.224914 -0.319203
H  0.822017 1.826843 1.308626
H  -0.525621 1.729087 -1.447683
H  -0.985087 0.220211 1.199561
H  1.714418 -0.424059 1.245993
H  0.003971 -1.787234 0.170579
H  0.207436 -0.967221 -1.393054
H  -2.190716 -0.288499 -1.582743
H  0.979825 4.174587 0.652693
H  1.370014 3.754656 -1.032187
H  -1.378356 3.684133 -0.129233
H  -1.654038 2.624528 1.277387
H  3.159519 3.478639 1.457039
H  3.676898 3.797232 -0.206049
H  -2.982848 2.437703 -1.501979
H  -3.79985 2.922087 0.000363
H  2.948236 0.418773 -2.199126
H  1.215534 0.780201 -2.421124
H  2.383947 2.114551 -2.251192
H  -2.519776 -1.665482 1.151616
H  -2.037113 -2.411353 -0.389508
H  -4.437664 -2.97633 0.196686
H  -4.329092 -2.064603 -1.327402
H  -5.367272 1.233695 0.501932
H  4.595829 -3.849798 0.407563
H  4.738409 -2.608766 -0.926698
