program: Gaussian 09
title: 000194179
version: EM64L-G09RevD.01
frameworkgroup: C1[X(C12H16N2O11)]
method: RPBEPBE
basis: SDD
operation: Freq
keyword: #p
keyword: freq=noraman
keyword: PBEPBE/SDD
title: #p freq=noraman PBEPBE/SDD
converged: YES YES NO NO
title: Mulliken charges:
elementType: O O O O O O O O O O O N N C C C C C C C C C C C C H H H H H H H H H H H H H H H H
charge: -0.257817 -0.403080 -0.235117 -0.397194 -0.426174 -0.385288 -0.397317 -0.263605 -0.325322 -0.239805 -0.222735 -0.371382 -0.725368 -0.145658 -0.247569 -0.458206 -0.452420 -0.271080 -0.257533 0.217338 0.153611 0.206875 0.160412 0.210173 0.169430 0.297583 0.300889 0.270145 0.260307 0.284832 0.251101 0.280950 0.363471 0.302356 0.378501 0.388939 0.382541 0.377995 0.434156 0.396898 0.394169
chargesum: 0.00000
title: Mulliken charges with hydrogens summed into heavy atoms:
elementType: O O O O O O O O O O O N N C C C C C C C C C C C C
charge: -0.257817 -0.020539 -0.235117 -0.019199 -0.426174 0.011610 -0.003148 -0.263605 -0.325322 -0.239805 -0.222735 -0.007911 0.476228 0.151925 0.053320 0.072247 0.083512 0.009870 0.044823 0.217338 0.153611 0.206875 0.160412 0.210173 0.169430
polarizability: 2.17086353e+02 7.02713985e+00 1.52313813e+02 3.10981485e+00 3.58637072e+00 1.64247425e+02
1716.lowfreq: -6.7426 -1.6154 -0.0003 0.0002 0.0006 5.9029 24.1666 30.6220 39.2559
frequency: 24.1512 30.5042 39.2317 44.0196 50.4084 60.3324 68.9853 81.1096 86.5307 100.8107 109.8299 123.9834 139.6254 156.4585 158.3687 170.6192 193.9751 202.2872 215.2455 241.5368 246.7435 266.8708 297.6033 308.4740 344.2764 365.5211 371.1509 395.4622 429.3663 466.2823 475.4188 503.7185 517.8160 528.5701 534.4479 558.0786 584.5321 591.7374 607.5007 619.9813 628.7592 635.9928 642.2092 679.7838 680.6531 699.7312 710.9708 713.3270 725.5575 735.6812 761.9539 776.9587 811.0278 855.3491 870.9370 875.4390 886.2753 924.5061 945.6877 961.5709 1004.9357 1017.3085 1027.1915 1050.0961 1057.5554 1073.7589 1079.7099 1092.3594 1120.8760 1129.4176 1163.5291 1187.5180 1195.2669 1204.4465 1216.5361 1227.9649 1242.7076 1251.8716 1270.0461 1277.4967 1288.3893 1300.2626 1327.2404 1331.0237 1332.8295 1342.9888 1351.0468 1369.7351 1376.0993 1386.1285 1445.5539 1465.0996 1489.8041 1573.7640 1593.2449 1621.2160 1629.2183 1643.1926 1644.3985 1656.6011 1667.5246 1702.5902 2994.9077 3011.9764 3027.8107 3048.4011 3054.8619 3056.5631 3077.5699 3093.7691 3331.4304 3435.4842 3476.9681 3503.5050 3507.8380 3517.2335 3518.9242
redmass: 7.8732 7.1191 10.3500 8.5142 8.1052 8.8705 10.4454 7.6751 9.4369 8.7167 9.1224 8.7834 7.9644 6.6532 4.6357 8.5357 8.0862 5.9276 7.6487 4.9336 5.2884 7.6576 3.8435 2.9117 3.7085 5.6837 6.3077 5.6298 4.6032 3.9994 3.5597 3.3335 3.2998 2.4047 1.7181 2.5732 3.0205 2.1185 3.2471 2.7636 1.3262 1.5652 1.9859 2.5255 3.3003 2.1666 3.1370 3.6684 5.5966 3.4219 4.7819 3.5025 3.2155 4.3399 4.4113 3.3972 4.1527 3.4969 3.0898 2.3492 2.2600 2.8182 2.1922 3.0417 2.4881 2.4017 1.9723 1.8367 3.2536 3.9031 1.2253 1.2040 1.3932 1.2496 1.4253 1.6499 1.4012 1.3388 1.4214 1.5087 1.7086 1.9006 1.6813 1.9260 2.0166 1.8703 1.7469 1.5026 1.8754 1.4762 1.0946 1.0886 2.0329 2.1825 2.0254 1.8526 2.3998 4.7491 3.2869 9.1463 4.9719 1.0965 1.0805 1.0606 1.0613 1.0884 1.0833 1.0837 1.1010 1.1036 1.0505 1.0909 1.0791 1.0641 1.0638 1.0643 1.0639
irintensity: 1.3831 0.5122 1.8786 3.4456 4.7098 0.8169 1.6424 2.3255 1.9259 0.3236 1.3301 9.1929 2.4976 4.1622 9.9322 2.3369 5.0685 1.6097 5.9421 20.1261 1.6075 2.5916 17.9390 11.6467 79.2448 8.8709 20.4438 2.8484 12.8224 23.4139 23.5675 207.0146 17.2425 4.5480 105.2494 58.2518 36.6081 150.1897 106.3386 198.6172 161.1042 117.6159 62.3070 149.2820 112.2979 70.5062 4.9733 72.6191 8.1197 22.5703 23.2650 4.6787 33.9501 55.2290 63.8450 106.0891 15.1477 70.3576 43.0875 1865.2584 48.7471 88.4906 289.5528 98.2758 71.1655 263.4167 51.4837 105.2168 155.9693 27.8990 65.4669 131.6648 26.2282 7.8071 61.6591 14.0068 2.0565 98.9051 30.6093 19.5555 38.7516 16.3447 198.1400 47.3617 76.5845 10.1004 115.9653 27.1395 47.0451 20.3165 34.9027 15.8876 250.6798 312.7584 409.7807 182.8687 54.2675 377.1286 16.7413 252.6141 213.2373 64.5998 19.9163 6.6197 13.5011 2.5264 3.4278 2.8606 5.0276 0.5151 101.9936 60.2497 88.8862 48.2226 29.1390 50.7481 30.4338
temp: 298.150 k
press: 1.00000 atm
elementType: 8 8 8 8 8 8 8 8 8 8 8 7 7 6 6 6 6 6 6 6 6 6 6 6 6 1 1 1 1 1 1 1 1 1 1 1 1 1 1 1 1
symmnumber: 1
zpe: 783073.8 jmol-1
zpe.correction: 0.298257 hartree
zpe.thermalcorrener: 0.323360 hartree
zpe.thermalcorrenthalpy: 0.324305 hartree
zpe.thermalcorrgfe: 0.241365 hartree
zpe.sumelectzpe: -1401.998285 hartree
zpe.sumelectthermal: -1401.973182 hartree
zpe.sumelectthermalent: -1401.972238 hartree
zpe.sumelectthermalfe: -1402.055177 hartree
dipole: -6.3706 -0.5258 3.7537
dipole: 7.4129
quadrupole: -118.8097 -152.6717 -139.5125
quadrupole: 2.7425 2.9426 0.1927
quadrupole: 18.1883 -15.6737 -2.5145 2.7425 2.9426 0.1927
hfenergy: -1402.2965423 hartree
pointgroup: C01 [X(C12H16N2O11)]
dipole: 2.6416837 0.9391151 0.8033086 debye
polarizability: 212.1999315|-14.2319285|166.2386036|11.7496775|2.4377882|155.2090558 unknown
InChI: InChI=1S/C12H16N2O11/c15-7-5(1-3(8(16)17)9(18)19)14-26-25-12(24)4(10(20)21)2-6(13-7)11(22)23/h3-6,13,16,18,20,22H,1-2,14H2
charge 0 multiplicity 1
41 atoms
O  0.686421 -1.243611 -2.221908
O  -1.605982 2.472458 -2.630852
O  -3.661038 1.481161 -3.049996
O  -4.721659 0.660927 1.250353
O  -1.285661 -2.21036 0.533054
O  3.834019 1.50914 2.310609
O  5.661815 -1.625624 1.386221
O  -3.062319 1.743195 0.052597
O  -1.407202 -0.23592 1.735095
O  2.768033 -0.496642 2.785705
O  3.981857 -2.65046 0.158115
N  -0.705288 0.34385 -1.220355
N  1.195152 -1.810634 0.618097
C  -1.840593 0.104448 -2.118576
C  1.315536 -0.430097 -0.006185
C  -2.880835 -0.880827 -1.488037
C  2.753769 -0.062431 -0.446947
C  -3.148058 -0.720766 0.040741
C  3.89787 -0.19949 0.605765
C  0.40665 -0.45588 -1.263634
C  -2.492255 1.396334 -2.615326
C  -3.608011 0.672265 0.419297
C  -1.865197 -1.061767 0.872903
C  3.445945 0.215278 2.007557
C  4.470263 -1.621301 0.669792
H  -1.423204 -0.394841 -3.017067
H  0.918692 0.273281 0.746178
H  -2.502766 -1.90856 -1.618857
H  -3.826312 -0.776874 -2.049415
H  3.010311 -0.684335 -1.324387
H  2.727344 0.988248 -0.788819
H  -3.929614 -1.447331 0.32246
H  -0.889898 0.954661 -0.415717
H  4.728036 0.467018 0.315802
H  1.721029 -2.49724 0.049502
H  1.584768 -1.783003 1.578954
H  -2.088782 3.275923 -2.965803
H  -4.951332 1.594389 1.511371
H  0.005177 -2.105577 0.670987
H  3.489537 1.771438 3.208593
H  6.029085 -2.549347 1.445332
