program: Gaussian 09
title: 000194160
version: EM64L-G09RevD.01
frameworkgroup: C1[X(C16H28O2)]
method: RPBEPBE
basis: SDD
operation: Freq
keyword: #pfreq=noraman
keyword: PBEPBE/SDD
title: #p freq=noraman PBEPBE/SDD
converged: YES YES NO NO
title: Mulliken charges:
elementType: O O C C C C C C C C C C C C C C C C H H H H H H H H H H H H H H H H H H H H H H H H H H H H
charge: -0.422143 -0.241160 -0.349089 -0.387096 -0.345582 -0.473903 -0.357952 -0.195849 -0.486068 -0.697204 -0.454854 -0.140219 -0.471751 -0.379738 -0.185973 -0.175701 -0.473112 0.184415 0.184302 0.203479 0.198533 0.192966 0.182233 0.179908 0.201317 0.205793 0.224289 0.180374 0.221600 0.199997 0.209370 0.209150 0.204772 0.216816 0.206315 0.215245 0.219671 0.198410 0.214389 0.223867 0.219516 0.223094 0.222649 0.244340 0.276738 0.373849
chargesum: 0.00000
title: Mulliken charges with hydrogens summed into heavy atoms:
elementType: O O C C C C C C C C C C C C C C C C
charge: -0.048294 -0.241160 0.038691 0.004403 0.016559 -0.066793 0.046711 0.025751 -0.076701 -0.066465 -0.033295 0.079452 -0.058953 0.063645 0.037121 0.046948 0.047966 0.184415
polarizability: 2.00888680e+02 -6.88854892e-01 1.81284554e+02 1.49775426e+00 -1.15918620e+01 1.56986084e+02
1716.lowfreq: -13.6976 -10.1719 -7.3912 -0.0001 0.0006 0.0007 3.3790 16.2388 20.2829
frequency: -7.9198 15.3381 18.9910 29.1161 42.0093 45.3685 59.4590 78.5807 82.0443 97.2933 106.0390 119.9668 123.8914 152.1843 162.4674 181.9779 208.5072 222.1449 232.9790 269.4238 294.8913 325.6707 333.6608 396.7850 419.9682 439.8046 454.8675 463.0467 477.0791 506.8956 519.4752 588.2487 637.6687 726.9733 746.0842 748.8696 782.2297 793.6615 817.9562 829.0288 852.4008 866.3940 873.1103 887.1672 903.6969 933.2213 936.0463 967.1813 974.7444 987.7456 992.9593 1000.1012 1004.1628 1029.5388 1050.1956 1072.2632 1073.7244 1076.3418 1081.4445 1094.5894 1108.0158 1114.5347 1135.8712 1151.6132 1181.2668 1186.2894 1201.4152 1203.2413 1217.4001 1241.7167 1250.8066 1257.5115 1262.2116 1279.0358 1282.8229 1283.5203 1288.3758 1291.4288 1295.8542 1308.2953 1310.2012 1316.6384 1321.7087 1337.8961 1348.4308 1350.3813 1354.0908 1370.7081 1385.0730 1437.8288 1455.9401 1459.1377 1461.7516 1464.5517 1465.6238 1466.0549 1471.6867 1474.1702 1475.7258 1481.5067 1490.0501 1663.2880 1682.6514 1682.7513 2947.2441 2950.2613 2955.7319 2958.0259 2962.7920 2963.6655 2965.5881 2967.3863 2969.3974 2983.8426 2986.8258 2997.4230 3001.3441 3017.1356 3020.9370 3023.4733 3024.4807 3032.6849 3036.2696 3036.9446 3056.4962 3061.7816 3061.9084 3064.7212 3067.7727 3070.0282 3079.8460 3509.6169
redmass: 5.1801 5.5798 5.2322 3.4821 5.7234 4.6557 1.7430 2.6156 2.5107 2.2311 2.6603 2.5031 1.8594 3.0693 2.6335 2.4504 2.5253 1.1372 2.4830 3.6878 2.2303 2.6044 2.7568 2.7462 4.1071 3.1378 2.5616 2.5320 2.2757 1.7761 2.2222 4.2571 1.3484 1.0704 1.3024 1.1696 1.4983 1.6603 1.4192 2.4688 1.7760 1.8708 2.5144 1.8897 2.5396 1.4608 2.0072 1.1643 1.2068 1.8806 1.6337 2.3628 1.8962 2.5912 2.2330 2.2289 2.2248 2.2164 1.7157 2.5824 2.0766 2.3222 1.5694 1.6152 1.4666 1.3768 1.4548 1.3105 1.2928 1.4691 1.2803 1.2849 1.2614 1.1920 1.1498 1.1618 1.1891 1.2546 1.1900 1.2920 1.3237 1.4163 1.4119 1.4093 1.4752 1.4844 1.6315 1.7883 1.2175 1.0831 1.0931 1.0948 1.1036 1.0812 1.0687 1.0970 1.0838 1.0584 1.0501 1.0791 1.0942 8.0688 6.5287 6.5329 1.0593 1.0600 1.0619 1.0607 1.0608 1.0602 1.0626 1.0604 1.0370 1.0621 1.0955 1.0631 1.0982 1.1014 1.0964 1.0976 1.1000 1.0972 1.1034 1.0977 1.0950 1.0936 1.0998 1.1005 1.0896 1.0991 1.0889 1.0639
irintensity: 0.2776 0.5988 0.0133 0.0054 0.7459 0.3465 0.0632 0.2932 0.4367 0.6833 0.5633 0.1715 0.0322 1.7390 1.0505 0.7578 2.1293 0.0222 0.4103 0.6605 0.1774 0.5763 0.3527 0.9528 7.5178 15.0371 1.9425 6.8695 0.3480 28.4427 2.0826 18.5309 139.2766 9.1155 14.9983 3.6061 6.8359 1.5549 3.0304 3.2467 2.6968 9.3608 2.7210 1.8418 11.3527 1.2181 1.0094 56.3463 31.0172 25.2688 24.7697 55.7855 13.5787 2.0528 138.6681 1.8511 15.4489 1.2303 11.4047 2.7846 4.3575 2.1124 9.5311 0.2689 1.2858 5.4911 2.4105 5.0464 0.5280 0.5613 2.3414 0.9302 0.3117 3.3061 0.8793 0.1646 0.4945 1.0955 4.0976 0.7752 5.0829 15.1405 14.9276 3.2494 1.4499 0.8761 1.1050 30.3007 11.0823 25.8274 12.8727 12.7464 8.4849 5.2815 2.8414 9.3485 7.8230 8.2167 12.3786 0.7319 21.0491 203.8376 0.0809 0.1437 0.4556 7.6361 27.2041 4.7988 153.6302 18.1616 86.4695 60.4095 47.9239 7.2587 2.5938 20.6813 1.4933 15.8289 33.8781 21.9078 19.5067 0.6332 90.1374 21.1600 4.0662 12.5759 21.6705 85.5684 105.7492 44.7351 70.7684 18.8685
temp: 298.150 k
press: 1.00000 atm
elementType: 8 8 6 6 6 6 6 6 6 6 6 6 6 6 6 6 6 6 1 1 1 1 1 1 1 1 1 1 1 1 1 1 1 1 1 1 1 1 1 1 1 1 1 1 1 1
symmnumber: 1
zpe: 1060192.7 jmol-1
zpe.correction: 0.403806 hartree
zpe.thermalcorrener: 0.425584 hartree
zpe.thermalcorrenthalpy: 0.426528 hartree
zpe.thermalcorrgfe: 0.349285 hartree
zpe.sumelectzpe: -775.474084 hartree
zpe.sumelectthermal: -775.452306 hartree
zpe.sumelectthermalent: -775.451362 hartree
zpe.sumelectthermalfe: -775.528605 hartree
dipole: 1.4755 -0.1427 0.4152
dipole: 1.5395
quadrupole: -116.9705 -109.3800 -110.7903
quadrupole: 4.5152 -5.6829 1.2663
quadrupole: -4.5903 3.0003 1.5899 4.5152 -5.6829 1.2663
hfenergy: -775.8778902 hartree
pointgroup: C01 [X(C16H28O2)]
dipole: -0.5806456 0.0191247 -0.1712337 debye
polarizability: 200.7858449|-1.5750408|177.1230753|2.8897273|14.6333066|161.2503987 unknown
InChI: InChI=1S/C16H28O2/c1-2-3-4-5-6-7-8-9-10-11-12-13-14-15-16(17)18/h7-8,11-12,17H,2-6,9-10,13-15H2,1H3
charge 0 multiplicity 1
46 atoms
O  1.863537 1.486728 -2.578522
O  3.163613 1.708409 -0.66965
C  0.788319 -1.960143 -0.297412
C  0.065143 -3.011269 -1.167267
C  1.94383 -2.54167 0.547713
C  -1.132184 -2.421416 -1.971985
C  2.649214 -1.480962 1.424256
C  -2.303355 -2.034256 -1.090428
C  -3.840648 -0.377486 0.096406
C  3.799849 -2.066393 2.27096
C  -3.366208 0.272935 1.437273
C  -2.697907 -0.761811 -0.820778
C  -0.478865 3.003329 1.537493
C  0.892555 2.727835 0.861299
C  -2.557732 1.539031 1.243892
C  -1.303491 1.745203 1.725113
C  0.73134 2.196955 -0.575299
C  2.041638 1.795445 -1.216747
H  1.185941 -1.160688 -0.958735
H  0.050346 -1.473574 0.372736
H  0.78906 -3.461778 -1.876892
H  -0.29846 -3.838836 -0.52292
H  2.691213 -3.017193 -0.122172
H  1.550934 -3.351955 1.197913
H  -1.465432 -3.174928 -2.71472
H  -0.78336 -1.537415 -2.542161
H  3.040629 -0.668677 0.779221
H  1.89892 -1.010795 2.094554
H  -2.85007 -2.86908 -0.620358
H  -4.511568 0.33966 -0.42105
H  -4.448748 -1.271739 0.334443
H  4.57788 -2.514351 1.623971
H  3.432613 -2.858968 2.950757
H  4.284233 -1.287384 2.888055
H  -4.270765 0.499734 2.04065
H  -2.771127 -0.465319 2.008004
H  -2.141253 0.07044 -1.280357
H  -1.052089 3.743234 0.943898
H  -0.284341 3.469381 2.525521
H  1.463544 1.991729 1.458714
H  1.496183 3.654982 0.852113
H  -3.043807 2.341674 0.663922
H  -0.819066 0.938083 2.300141
H  0.237306 2.94063 -1.229634
H  0.069149 1.307783 -0.580812
H  2.739689 1.211988 -2.964522
