program: Gaussian 09
title: 000194138
version: EM64L-G09RevD.01
frameworkgroup: C1[X(C10H14O4)]
method: RPBEPBE
basis: SDD
operation: Freq
keyword: #pfreq=noraman
keyword: PBEPBE/SDD
title: #p freq=noraman PBEPBE/SDD
converged: YES YES NO NO
title: Mulliken charges:
elementType: O O O O C C C C C C C C C C H H H H H H H H H H H H H H
charge: -0.244018 -0.484132 -0.481154 -0.407316 -0.191497 0.473263 -0.520154 0.254465 -0.368439 -0.443560 0.124015 -0.356233 -0.239992 -0.686140 0.223746 0.302142 0.210996 0.223415 0.232957 0.215651 0.214031 0.204816 0.365270 0.203388 0.231670 0.233825 0.357918 0.351066
chargesum: 0.00000
title: Mulliken charges with hydrogens summed into heavy atoms:
elementType: O O O O C C C C C C C C C C
charge: -0.244018 -0.118862 -0.123235 -0.056250 0.032249 0.473263 -0.218012 0.254465 0.065973 -0.210603 0.124015 -0.140583 0.178855 -0.017258
polarizability: 1.64331175e+02 8.54664233e-01 1.40289277e+02 -3.48375979e+00 6.03399738e-01 7.49286008e+01
1716.lowfreq: 0.0004 0.0007 0.0008 4.5166 6.5835 9.7379 32.5202 69.2300 78.2502
frequency: 32.4266 69.2180 78.2357 88.8844 113.8810 126.8532 169.5786 207.7448 239.4621 242.7300 249.5269 290.1386 298.2348 328.8925 339.2212 350.7557 404.6171 457.1869 487.9549 512.7540 535.1109 551.4013 588.7637 628.6773 723.7773 733.4253 780.5278 790.4639 825.8747 854.7623 884.1433 892.6189 908.9062 959.5546 981.4311 1017.4807 1033.8242 1050.4155 1086.0500 1115.7558 1134.9324 1151.2407 1161.3369 1183.3037 1186.8684 1227.1927 1235.4422 1264.2087 1267.7772 1290.3665 1313.1806 1366.3662 1377.4854 1393.1818 1399.2508 1410.5399 1423.2599 1458.2283 1460.3756 1476.5400 1488.5733 1512.0326 1605.9394 1616.0340 2952.6457 2955.2066 2967.8989 2996.3595 3013.4815 3036.8495 3093.5787 3106.0372 3108.7255 3136.9850 3179.3249 3509.9270 3573.5609 3597.2901
redmass: 4.4301 4.2759 4.0167 3.9692 1.7158 3.4918 4.9269 4.5902 1.7570 1.1262 2.1290 5.1165 4.7952 4.4052 1.7935 1.7639 5.1306 3.2388 2.9315 1.2366 3.8946 4.1028 5.7047 4.5039 4.2765 3.9965 4.9375 1.4862 1.1073 2.8659 2.8163 1.4212 1.3448 6.7511 3.1940 2.6576 2.6488 2.2254 2.2469 2.1584 1.4416 1.7553 1.2193 1.1383 1.2577 1.6182 1.4489 1.1506 2.9731 1.3516 1.2152 1.3270 1.3897 1.7106 1.3176 5.1349 3.5954 1.0828 1.0398 1.0694 1.0911 3.0581 6.7150 6.8445 1.0831 1.0558 1.0552 1.0362 1.1072 1.1090 1.0988 1.1013 1.0874 1.0960 1.0903 1.0647 1.0659 1.0669
irintensity: 4.2386 2.9333 1.4614 4.6324 4.1964 2.5866 0.6666 2.5558 5.2165 142.9835 1.2862 9.9910 5.3862 1.9373 48.3429 89.4955 5.4860 1.3088 0.9554 157.7050 43.6826 4.4580 12.4007 19.8649 13.0411 14.1351 11.0951 44.7914 10.3500 10.7224 2.1414 20.6493 6.2319 86.1928 64.9028 77.8903 55.5666 47.3553 167.7415 19.9919 5.3586 53.9142 87.6709 4.1581 20.4773 59.7588 42.6112 2.3958 133.2479 54.4671 18.3231 25.3190 4.6677 20.5422 17.2118 41.7501 50.5967 10.4626 11.3835 13.7259 17.0166 101.2186 51.4447 6.1640 28.1084 37.7869 47.6462 26.7291 34.8903 45.0987 28.6810 34.6667 19.6333 17.3787 4.3978 26.0787 33.1794 7.2529
temp: 298.150 k
press: 1.00000 atm
elementType: 8 8 8 8 6 6 6 6 6 6 6 6 6 6 1 1 1 1 1 1 1 1 1 1 1 1 1 1
symmnumber: 1
zpe: 590134.5 jmol-1
zpe.correction: 0.224770 hartree
zpe.thermalcorrener: 0.239677 hartree
zpe.thermalcorrenthalpy: 0.240621 hartree
zpe.thermalcorrgfe: 0.182569 hartree
zpe.sumelectzpe: -689.242587 hartree
zpe.sumelectthermal: -689.227681 hartree
zpe.sumelectthermalent: -689.226737 hartree
zpe.sumelectthermalfe: -689.284788 hartree
dipole: 2.2243 0.6111 2.4851
dipole: 3.3907
quadrupole: -78.9237 -66.0164 -83.9544
quadrupole: 1.3203 9.7031 -2.9151
quadrupole: -2.6255 10.2818 -7.6563 1.3203 9.7031 -2.9151
hfenergy: -689.4673574 hartree
pointgroup: C01 [X(C10H14O4)]
dipole: -0.8491219 0.0337123 -1.0282912 debye
polarizability: 164.4826601|0.545939|138.5137629|-0.079398|-10.6078241|76.5526292 unknown
InChI: InChI=1S/C10H14O4/c1-2-14-10-5-7(9(13)6-11)3-4-8(10)12/h3-5,9,11-13H,2,6H2,1H3
charge 0 multiplicity 1
28 atoms
O  2.56478 -0.416964 0.090937
O  -2.245034 -1.574989 1.199855
O  -4.366794 -1.350678 -0.491199
O  2.647198 2.212033 -0.423814
C  -2.453218 -0.304032 0.498977
C  -1.11326 0.384796 0.292694
C  0.083831 -0.371026 0.310747
C  1.333029 0.244496 0.07551
C  -3.147754 -0.593189 -0.84817
C  -1.058117 1.771632 0.03785
C  1.381675 1.646078 -0.194654
C  0.187048 2.395456 -0.208513
C  2.55431 -1.861614 0.397761
C  4.008542 -2.32332 0.369446
H  -3.127209 0.34862 1.095213
H  0.006229 -1.435178 0.545192
H  -3.401638 0.353582 -1.364578
H  -2.475454 -1.200885 -1.487585
H  -1.97424 2.37376 0.043263
H  0.230271 3.475337 -0.403703
H  2.095942 -2.023762 1.394853
H  1.944829 -2.396068 -0.360185
H  -3.09601 -2.081389 1.105529
H  4.068664 -3.404023 0.593795
H  4.454092 -2.14399 -0.623859
H  4.603995 -1.774411 1.118601
H  -4.806306 -1.699269 -1.304726
H  2.557702 3.184396 -0.586139
