program: Gaussian 09
title: 000194137
version: EM64L-G09RevD.01
frameworkgroup: C1[X(C20H22N4O4S)]
method: RPBEPBE
basis: SDD
operation: Freq
keyword: #p
keyword: freq=noraman
keyword: PBEPBE/SDD
title: #p freq=noraman PBEPBE/SDD
converged: YES YES NO NO
title: Mulliken charges:
elementType: S O O O O N N N N C C C C C C C C C C C C C C C C C C C C H H H H H H H H H H H H H H H H H H H H H H
charge: 0.646395 -0.313970 -0.596014 -0.300464 -0.204497 -0.378213 -0.382831 -0.010957 -0.427370 0.308333 0.028040 -0.384115 -0.328166 0.219769 0.285590 -0.330933 -0.316714 -0.171571 -0.353267 -0.230484 -0.681010 -0.119865 0.252340 -0.221813 -0.256399 -0.213486 -0.213390 -0.225295 -0.493446 0.202282 0.218190 0.218172 0.266150 0.229230 0.324771 0.329815 0.197549 0.188012 0.226279 0.410945 0.216219 0.219411 0.213004 0.301309 0.228881 0.237893 0.232457 0.232794 0.233782 0.244512 0.242145
chargesum: 0.00000
title: Mulliken charges with hydrogens summed into heavy atoms:
elementType: S O O O O N N N N C C C C C C C C C C C C C C C C C C C C
charge: 0.646395 -0.313970 -0.596014 -0.300464 -0.204497 -0.378213 -0.053017 -0.010957 -0.016424 0.308333 0.028040 0.100207 0.092306 0.219769 0.285590 -0.101704 0.008057 -0.171571 0.032295 -0.004205 -0.032374 -0.119865 0.252340 0.079496 -0.027518 0.024408 0.019066 0.007498 0.226993
polarizability: 3.82195502e+02 2.23877243e+01 3.22514939e+02 1.52993698e+00 -1.21669137e+00 1.97036280e+02
1716.lowfreq: -19.3679 -7.6601 -3.8314 -2.0155 0.0015 0.0015 0.0020 10.0980 19.9597
frequency: -18.5923 9.6139 19.4080 33.6617 36.9542 44.4152 45.7714 53.5385 60.8273 72.7764 75.5726 86.5651 104.9025 119.5656 127.7675 149.9130 164.5583 178.5097 188.1425 215.2218 217.7250 230.2799 239.0108 248.9673 268.5109 291.1543 296.3195 308.5720 328.9139 347.7667 368.6291 382.6055 404.2982 423.1013 426.7298 437.7032 447.2294 491.0350 498.3983 531.9758 575.0910 604.8280 607.3502 617.9634 649.6633 666.1871 673.1002 681.4983 696.8048 699.3629 712.8776 731.9124 739.3758 756.2325 763.1523 767.4645 789.7960 801.1407 839.5349 846.0796 853.2214 862.4232 868.4056 912.4043 916.7332 930.3166 933.7170 942.6445 945.9017 975.1427 978.3510 983.6335 1006.0401 1009.4244 1018.6043 1029.9838 1037.7726 1046.3342 1059.7619 1074.2767 1109.2166 1119.0476 1119.4755 1136.0884 1140.5185 1155.7319 1159.4292 1170.3596 1175.0552 1187.8895 1209.9058 1228.2953 1236.8189 1261.5534 1271.0423 1287.0469 1296.8105 1299.3790 1310.3707 1350.3815 1366.9492 1382.9104 1391.9180 1392.1402 1420.2970 1425.8712 1430.7797 1451.8638 1452.7820 1455.3831 1456.2272 1461.2983 1467.2081 1469.6920 1477.7650 1484.4706 1502.5956 1506.1027 1561.9617 1581.0221 1596.1287 1602.0212 1613.5400 1652.8503 1690.5392 2956.3195 2977.5947 2981.7897 2997.5735 3002.5515 3002.5989 3046.9387 3074.5340 3078.5926 3087.3943 3103.0411 3119.5061 3124.0089 3132.0428 3136.6341 3141.0203 3147.4602 3150.4925 3152.7182 3166.5991 3302.3296 3553.9366
redmass: 3.4864 5.3582 4.6646 5.3318 4.3402 4.7081 4.3927 2.1564 5.2501 3.0269 1.5083 3.3891 4.1233 4.0731 4.0948 6.2558 4.9280 6.0236 5.7496 4.9289 3.2290 1.4335 3.7570 5.3950 5.8172 3.4947 6.3496 5.1952 6.3454 5.9804 7.8421 4.5910 2.8942 6.4252 5.8340 8.0006 3.6420 3.7280 2.2748 6.8116 1.3163 6.3025 5.4744 4.0565 6.8971 7.1965 7.6655 7.1798 8.9383 2.2008 6.0339 1.6423 3.1730 1.5239 4.6985 2.7018 1.6307 8.1496 1.7218 2.4547 1.2473 1.1930 6.2221 1.3777 3.1152 1.3796 3.1065 3.2957 1.3984 1.7323 6.0111 1.3655 1.5053 3.0739 3.9394 1.9573 6.4686 2.0704 2.9608 1.5672 3.2139 2.0431 1.2660 2.0329 1.9354 1.5572 1.9388 1.0710 1.1289 2.8074 4.9175 1.3241 2.0182 1.3849 2.0423 1.1194 3.2743 1.3464 1.3178 1.5175 1.3389 8.8422 1.2768 2.7292 4.0654 1.1841 2.1965 1.0496 2.5908 1.0862 3.0521 1.1370 1.0571 1.0714 1.0425 1.0695 1.7610 2.2650 6.2566 5.8486 8.0503 6.8348 7.3976 6.2708 8.8445 1.0588 1.0370 1.0593 1.0725 1.0299 1.0932 1.1010 1.1006 1.0996 1.0988 1.1047 1.0885 1.0874 1.0871 1.0900 1.0920 1.1043 1.0956 1.0965 1.1011 1.0796 1.0779
irintensity: 0.4607 0.7032 0.3040 0.1057 0.9626 1.9271 0.6994 1.4240 1.1751 1.3287 0.2556 1.8443 3.0132 0.2942 1.6663 2.6803 6.0027 2.2717 11.4502 1.0914 7.2922 2.2447 6.0588 18.5699 1.3154 12.7694 3.2367 3.2648 2.6999 2.0519 15.9030 17.6072 0.3222 6.0037 12.4346 11.8554 12.2555 36.2541 6.3603 4.4646 83.1352 4.0604 24.2668 19.0606 1.5094 3.4468 9.1708 10.3851 5.8554 46.5647 1.6870 10.6430 8.5542 52.8258 4.4709 12.0431 24.5701 42.4084 3.7476 0.6007 0.7396 128.2838 22.2942 1.1237 1.0465 5.1472 1.7736 4.8856 20.6089 27.7555 4.4867 0.5083 1.8490 4.9592 3.1122 30.4478 163.2020 6.7258 94.9056 9.9168 43.2476 16.5981 0.2219 4.6640 263.8576 15.0492 25.6040 5.4184 23.5729 312.3685 152.8600 12.2699 45.1135 5.8677 68.8750 10.2484 249.4728 3.2495 102.5754 1.3885 6.9487 2.6426 18.1923 44.7967 52.2693 13.2236 13.4858 12.6156 81.6302 6.3224 38.7439 72.4471 38.0284 8.9566 13.2366 14.0094 501.5298 378.7061 657.3764 7.1295 347.3837 9.5827 28.0020 355.1476 199.6141 44.2534 23.8385 53.9096 42.3276 52.1046 5.1639 55.3523 79.7833 37.7653 5.3845 27.3545 6.1183 5.0962 1.0486 1.4254 24.0606 16.7370 15.5100 19.3879 36.3745 280.0207 27.8434
temp: 298.150 k
press: 1.00000 atm
elementType: 16 8 8 8 8 7 7 7 7 6 6 6 6 6 6 6 6 6 6 6 6 6 6 6 6 6 6 6 6 1 1 1 1 1 1 1 1 1 1 1 1 1 1 1 1 1 1 1 1 1 1
symmnumber: 1
zpe: 1031991.6 jmol-1
zpe.correction: 0.393065 hartree
zpe.thermalcorrener: 0.421013 hartree
zpe.thermalcorrenthalpy: 0.421957 hartree
zpe.thermalcorrgfe: 0.330373 hartree
zpe.sumelectzpe: -1691.134465 hartree
zpe.sumelectthermal: -1691.106517 hartree
zpe.sumelectthermalent: -1691.105573 hartree
zpe.sumelectthermalfe: -1691.197157 hartree
dipole: -1.8167 9.4047 1.9167
dipole: 9.7685
quadrupole: -162.7353 -169.1505 -177.1730
quadrupole: 12.3734 17.4351 -17.0477
quadrupole: 6.9510 0.5358 -7.4867 12.3734 17.4351 -17.0477
hfenergy: -1691.5275297 hartree
pointgroup: C01 [X(C20H22N4O4S1)]
dipole: -1.0538653 3.5515946 1.0226255 debye
polarizability: 377.4694486|27.5183287|326.7691845|1.950573|8.0557418|197.5080874 unknown
InChI: InChI=1S/C20H22N4O4S/c1-3-4-12-21-19(25)24-17-11-10-15(29(27)14-8-6-5-7-9-14)13-16(17)22-18(24)23-20(26)28-2/h5-11,13,21,23H,3-4,12H2,1-2H3
charge 0 multiplicity 1
51 atoms
S  3.954364 -0.196542 -1.770883
O  -4.040773 0.360632 0.658071
O  4.118762 -1.839327 -2.03745
O  -4.833403 -3.627581 0.640253
O  -2.866254 -4.444179 -0.362468
N  -1.893929 -0.131431 -0.161893
N  -2.862521 2.010753 -0.495622
N  -0.862874 -2.177702 -0.511072
N  -3.202245 -2.147365 0.20108
C  -0.543884 0.154972 -0.518409
C  0.057277 -1.131905 -0.743973
C  -3.904252 3.046106 -0.323896
C  -3.498373 4.16682 0.66027
C  -1.995948 -1.575518 -0.157648
C  -2.999527 0.756112 0.042631
C  0.202375 1.348352 -0.600088
C  1.413236 -1.231716 -1.114652
C  2.1274 -0.030282 -1.211589
C  -2.284219 5.006102 0.201727
C  1.565485 1.241113 -0.96843
C  -1.966773 6.16507 1.171569
C  4.762597 0.050911 -0.046143
C  -3.536745 -3.503614 0.102509
C  5.169253 -1.120561 0.609267
C  4.98719 1.338377 0.472597
C  5.808751 -0.997229 1.864549
C  5.630618 1.448193 1.729276
C  6.036032 0.283364 2.423136
C  -5.37639 -5.001496 0.613021
H  -4.374258 4.835148 0.785728
H  -3.295502 3.720504 1.653199
H  -4.129848 3.477014 -1.318636
H  -4.808794 2.529215 0.037618
H  -0.205122 2.332584 -0.348812
H  1.908372 -2.188702 -1.317403
H  -2.066498 2.20949 -1.102734
H  -2.480205 5.413157 -0.811857
H  -1.390141 4.353837 0.11504
H  2.17283 2.149244 -1.049918
H  -3.907636 -1.490983 0.583749
H  -1.740963 5.78311 2.18455
H  -1.096116 6.753084 0.829169
H  -2.827587 6.854072 1.257237
H  4.985637 -2.087898 0.123456
H  4.685399 2.238217 -0.076308
H  6.131908 -1.896197 2.400443
H  5.819014 2.438442 2.158373
H  6.536155 0.374456 3.39372
H  -6.368975 -4.91847 1.077364
H  -4.725918 -5.68355 1.186149
H  -5.45418 -5.364105 -0.426063
