program: Gaussian 09
title: 000194127
version: EM64L-G09RevD.01
frameworkgroup: C1[X(C10H14N5O12P3)]
method: RPBEPBE
basis: SDD
operation: Freq
keyword: #p
keyword: freq=noraman
keyword: PBEPBE/SDD
title: #p freq=noraman PBEPBE/SDD
converged: YES YES NO NO
title: Mulliken charges:
elementType: P P P O O O O O O O O O O O O N N N N N C C C C C C C C C C H H H H H H H H H H H H H H
charge: 1.495219 1.494235 1.452095 -0.230524 -0.565167 -0.386445 -0.868367 -0.766209 -0.558249 -0.774665 -0.748630 -0.558319 -0.689511 -0.660543 -0.617286 -0.146503 -0.361939 -0.033840 -0.044209 -0.618263 -0.102022 -0.159513 0.235150 -0.402895 -0.267297 0.163144 -0.023432 0.102189 0.165841 -0.349183 0.281143 0.268760 0.276750 0.339700 0.225050 0.335096 0.378645 0.253716 0.340009 0.404026 0.425787 0.427584 0.458997 0.409875
chargesum: 0.00000
title: Mulliken charges with hydrogens summed into heavy atoms:
elementType: P P P O O O O O O O O O O O O N N N N N C C C C C C C C C C
charge: 1.495219 1.494235 1.452095 -0.230524 -0.565167 -0.007801 -0.868367 -0.340422 -0.558249 -0.774665 -0.748630 -0.558319 -0.230514 -0.250668 -0.617286 -0.146503 0.065646 -0.033840 -0.044209 0.125772 0.179121 0.109247 0.235150 -0.126145 0.297453 0.163144 0.311664 0.102189 0.165841 -0.095467
polarizability: 2.63299631e+02 -4.65011403e-01 2.93990334e+02 2.38224821e+01 -7.86974776e+00 1.99833945e+02
1716.lowfreq: -3.5432 0.0006 0.0015 0.0019 4.9719 5.9789 15.6639 33.1978 37.1225
frequency: 15.4343 33.1355 37.0948 50.5508 65.8628 69.5225 78.3981 83.0274 90.7187 92.2867 100.8127 104.3784 125.1252 133.5926 150.9230 165.6093 172.5688 185.6894 190.8905 200.4775 215.8088 239.3135 244.3563 250.3378 259.4764 269.4265 271.4168 284.8689 301.8610 323.4826 325.6299 340.6817 343.1425 364.1093 373.2703 380.0101 382.7113 390.1147 400.9563 414.5003 424.8307 443.9057 476.0833 483.0811 508.2685 539.7185 545.4358 561.3258 572.3126 589.3998 605.3181 622.4944 638.3284 658.6480 673.6140 687.5515 716.2310 718.6600 739.4710 747.6981 754.5433 761.8480 784.1723 793.6947 797.5060 803.9374 811.2363 832.1154 835.1524 859.4364 868.0187 883.3004 909.7281 936.7349 943.2837 966.7221 983.9791 1005.4438 1006.0277 1021.0730 1054.8025 1057.2319 1090.1725 1103.7841 1106.6835 1110.7188 1124.0333 1164.4136 1192.8231 1215.2093 1228.4623 1233.3590 1252.4572 1255.4915 1285.1381 1300.5183 1301.2444 1303.7663 1325.9983 1343.7549 1371.9956 1376.3877 1394.1992 1417.8608 1435.3350 1467.0559 1511.6591 1530.7633 1561.2626 1608.7555 1650.2002 1667.9208 2418.2316 2971.2706 3020.9504 3022.8621 3073.6504 3075.5502 3176.3377 3198.8741 3272.9838 3360.1503 3578.1549 3588.5675 3613.1734 3620.4940
redmass: 10.9185 8.7318 8.8619 7.8008 9.5658 9.8994 7.0061 9.6108 7.0423 4.6874 5.2028 2.5515 5.5524 9.3913 7.2666 6.5561 6.4646 6.7299 7.5131 8.3024 6.7881 10.7994 3.5390 4.2033 4.4276 8.5131 5.8123 6.6828 4.9384 5.2793 5.6063 5.9856 6.6082 11.1502 2.8603 2.9463 5.7958 4.4864 3.3945 3.6626 3.1414 3.9135 4.6043 7.6679 8.4452 11.3495 4.6196 3.7034 1.3513 6.5117 7.4067 5.9769 3.0607 7.5079 5.8953 6.5036 5.9906 10.1288 3.4865 3.5954 6.4246 1.2165 3.2092 6.5403 1.3366 6.1993 2.4383 6.0399 2.3264 7.1658 5.3745 9.0849 3.8472 1.4452 5.3876 3.7518 1.7897 1.4741 2.0373 2.2172 2.4777 2.7321 6.2019 3.9992 1.7363 2.6675 2.9518 1.4131 1.6876 1.5181 2.3125 1.7491 1.2681 2.3484 1.6030 1.3868 2.4161 1.1599 4.3533 3.0010 1.3641 1.6870 1.8869 2.1858 2.6245 1.0865 4.2374 1.8297 8.3897 1.9445 8.1316 2.0807 1.1373 1.0634 1.0722 1.0842 1.0884 1.1042 1.0927 1.0975 1.1020 1.0613 1.0664 1.0661 1.0662 1.0923
irintensity: 0.3617 0.7632 2.4627 7.6395 5.5932 3.4362 4.3091 0.5021 1.1421 17.6476 8.4375 32.2103 10.4313 0.2483 3.5490 19.7687 9.2816 12.9690 11.5809 4.2575 4.7130 3.9226 23.5458 5.3946 16.1633 10.5140 42.2588 17.1612 11.7182 10.9576 19.0144 26.8410 15.8709 78.8863 35.3378 72.1863 90.3166 58.7574 14.0464 112.5774 36.3721 4.9707 22.8751 87.7595 0.1158 69.3194 40.6033 6.5260 42.1419 1.2756 14.6299 10.0304 69.1836 64.3458 6.3432 33.9317 82.1148 94.7274 269.8567 143.8153 45.2202 109.8368 49.6099 42.0382 127.4751 61.9340 100.7504 342.1757 270.0656 213.4070 59.9528 154.1421 157.1121 9.7470 39.9138 40.9013 100.7894 26.2755 35.6725 96.4677 104.0624 14.9723 230.9522 67.0020 187.3638 291.5465 44.1324 125.2492 102.9405 15.0092 20.6503 33.9873 4.8380 68.5438 15.0770 81.3676 50.3237 72.2403 68.0096 38.6310 6.4868 22.8304 20.7175 2.1479 15.9989 13.8178 21.2042 209.9658 145.9111 30.9584 194.5774 296.9602 2055.3547 40.5175 680.4082 108.9710 7.1367 24.1615 13.4520 4.1240 42.6338 425.4658 56.5582 87.2993 121.5531 126.3308
temp: 298.150 k
press: 1.00000 atm
elementType: 15 15 15 8 8 8 8 8 8 8 8 8 8 8 8 7 7 7 7 7 6 6 6 6 6 6 6 6 6 6 1 1 1 1 1 1 1 1 1 1 1 1 1 1
symmnumber: 1
zpe: 748064.5 jmol-1
zpe.correction: 0.284923 hartree
zpe.thermalcorrener: 0.315359 hartree
zpe.thermalcorrenthalpy: 0.316303 hartree
zpe.thermalcorrgfe: 0.223530 hartree
zpe.sumelectzpe: -2587.334283 hartree
zpe.sumelectthermal: -2587.303847 hartree
zpe.sumelectthermalent: -2587.302903 hartree
zpe.sumelectthermalfe: -2587.395676 hartree
dipole: 5.6102 5.1590 -0.7743
dipole: 7.6609
quadrupole: -194.5426 -165.6523 -218.4657
quadrupole: 10.3999 -22.8753 4.2823
quadrupole: -1.6558 27.2346 -25.5788 10.3999 -22.8753 4.2823
hfenergy: -2587.619206 hartree
pointgroup: C01 [X(C10H14N5O12P3)]
dipole: -1.6100492 -2.5057225 -0.4619342 debye
polarizability: 293.4579823|7.609817|246.3687754|-9.043306|36.3135146|217.2971522 unknown
InChI: InChI=1S/C10H14N5O12P3/c11-9-8-10(13-3-12-9)15(4-14-8)7-1-5(16)6(25-7)2-24-29(20,21)27-30(22,23)26-28(17,18)19/h1,3-4,6-7,14,16-18,20H,2,11H2
charge 0 multiplicity 1
44 atoms
P  -2.431663 1.199791 1.397465
P  0.595375 2.424592 2.163121
P  0.271396 3.252933 -0.872437
O  -1.029557 -1.815636 -2.110189
O  -2.548473 -0.120215 0.299401
O  -4.28669 -2.501341 -0.639421
O  -0.79093 1.512404 1.366253
O  -2.99887 2.604194 0.496245
O  -3.206413 0.927859 2.743555
O  1.103727 3.163442 0.661937
O  1.609537 1.196587 2.459796
O  0.100858 3.463524 3.242483
O  -1.133343 4.142479 -0.560955
O  1.281523 4.387983 -1.624246
O  0.10738 1.903138 -1.681695
N  0.348907 -2.432574 -0.238352
N  1.136521 -0.994385 1.27655
N  2.479792 -2.867171 -1.471959
N  4.346325 -1.508203 -0.605255
N  4.061789 0.089955 1.13415
C  -0.656884 -2.940654 -1.228072
C  -2.423886 -1.395959 -1.808068
C  -2.941114 -2.527168 -0.933031
C  -1.94928 -3.39912 -0.595967
C  -2.503565 0.018101 -1.191356
C  1.734053 -2.278398 -0.503204
C  0.037268 -1.636559 0.839354
C  2.209123 -1.353801 0.452749
C  3.559457 -0.903733 0.35144
C  3.783765 -2.440366 -1.431059
H  -0.118867 -3.681695 -1.842143
H  -2.945149 -1.364521 -2.783148
H  -2.027306 -4.300775 0.012598
H  -1.616358 0.605194 -1.50327
H  -3.436637 0.515475 -1.508322
H  -0.970882 -1.503583 1.216087
H  -4.546891 -3.199813 0.011422
H  4.458023 -2.892709 -2.163478
H  5.029322 0.375715 0.98694
H  3.438444 0.643194 1.74235
H  -3.899663 2.923512 0.753448
H  1.201889 -0.129685 1.945944
H  -1.924927 3.612381 -0.19218
H  1.58647 5.124711 -1.035183
