program: Gaussian 09
title: 000194112
version: EM64L-G09RevD.01
frameworkgroup: C1[X(C8H11NS2)]
method: RPBEPBE
basis: SDD
operation: Freq
keyword: #p
keyword: freq=noraman
keyword: PBEPBE/SDD
title: #p freq=noraman PBEPBE/SDD
converged: YES YES NO NO
title: Mulliken charges:
elementType: S S N C C C C C C C C H H H H H H H H H H H
charge: 0.046850 0.032103 0.031357 -0.330658 -0.617638 -0.667429 -0.265482 -0.156023 -0.161572 -0.179625 -0.341461 0.214543 0.219252 0.256143 0.295750 0.212615 0.221669 0.214611 0.252732 0.244015 0.235021 0.243225
chargesum: 0.00000
title: Mulliken charges with hydrogens summed into heavy atoms:
elementType: S S N C C C C C C C C
charge: 0.046850 0.032103 0.031357 0.103136 -0.065744 -0.018534 -0.265482 0.096709 0.082443 0.055396 -0.098236
polarizability: 1.91511172e+02 4.02485716e+00 1.29890249e+02 -5.62879271e+00 6.03177379e+00 7.47469167e+01
1716.lowfreq: -9.5700 -8.4461 -0.0021 0.0008 0.0018 5.2480 26.5875 33.2025 53.8344
frequency: 26.4202 33.1317 53.7481 96.1438 110.4348 118.1740 186.2776 221.8565 232.0375 303.5018 323.9067 397.7990 402.0263 442.7476 484.5161 606.9671 689.8630 697.9570 742.6182 753.5883 769.0347 865.0471 887.1882 896.2953 949.7255 953.5989 994.4797 1033.8003 1042.4426 1050.7317 1076.4441 1095.3343 1103.3565 1163.5337 1213.7391 1239.0534 1276.2557 1286.6196 1312.7078 1330.4098 1385.0614 1397.2869 1429.1716 1456.0899 1474.8117 1476.9339 1485.1437 1552.4589 1561.4369 2978.4418 2987.0507 3031.8570 3036.9047 3078.5954 3079.6438 3118.9154 3134.3631 3143.8745 3162.4083 3176.4111
redmass: 4.3642 4.2386 1.6435 5.8899 3.8339 4.4398 6.0762 4.0031 1.1103 4.7736 4.7881 5.5755 5.2635 16.7494 3.3897 7.5234 5.1870 6.9394 2.4500 1.0817 1.6354 1.1733 1.2917 1.9728 6.5806 1.4295 1.3416 2.8019 2.8199 1.1904 1.9912 2.1217 2.5970 1.0748 1.4146 1.2038 1.5045 1.1132 9.9432 1.4115 1.1992 1.8587 1.8983 1.0886 1.0553 1.0425 1.0779 5.6703 5.5386 1.0348 1.0594 1.0616 1.0965 1.1005 1.1005 1.1098 1.0880 1.0896 1.0949 1.1016
irintensity: 2.7579 0.6915 0.0506 1.0301 0.7403 2.0294 0.8780 2.6110 0.0477 2.4576 0.6708 2.4165 2.3208 1.1678 8.8281 0.8211 4.2955 17.6403 20.4503 8.5728 61.4805 0.1272 0.0019 8.6709 4.3776 0.5893 0.1350 10.4645 4.9799 3.8112 13.4316 39.2029 29.9327 3.1166 0.8658 4.2143 1.1808 0.4972 6.9982 4.3344 10.1803 29.4404 75.1112 3.7080 3.5608 13.5139 12.5207 16.6531 81.1278 39.2271 22.3904 16.0140 11.0392 45.4533 48.6052 16.1590 10.0883 8.7675 14.4696 21.0558
temp: 298.150 k
press: 1.00000 atm
elementType: 16 16 7 6 6 6 6 6 6 6 6 1 1 1 1 1 1 1 1 1 1 1
symmnumber: 1
zpe: 452250.5 jmol-1
zpe.correction: 0.172253 hartree
zpe.thermalcorrener: 0.184660 hartree
zpe.thermalcorrenthalpy: 0.185604 hartree
zpe.thermalcorrgfe: 0.130896 hartree
zpe.sumelectzpe: -1161.480624 hartree
zpe.sumelectthermal: -1161.468217 hartree
zpe.sumelectthermalent: -1161.467272 hartree
zpe.sumelectthermalfe: -1161.521980 hartree
dipole: 1.6919 2.2433 -0.6309
dipole: 2.8797
quadrupole: -61.1541 -79.0278 -84.5321
quadrupole: -0.6070 0.7571 1.9851
quadrupole: 13.7505 -4.1231 -9.6274 -0.6070 0.7571 1.9851
hfenergy: -1161.6528767 hartree
pointgroup: C01[X(C8H11N1S2)]
dipole: 0.6763928 0.8164416 0.3994185 debye
dipolederiv: -0.0251892 0.0211607 -0.0685401 -0.0567733 -0.0689364 -0.0768073 -0.0240127 -0.0384179 -0.1011359 -0.4019703 -0.0732665 -0.1350154 -0.0097974 -0.1445853 -0.0041683 -0.1976017 -0.1244874 -0.0856221 -0.3685577 0.0016836 0.0158745 -0.1649706 -0.3024602 -0.2090267 -0.4296289 -0.2888957 -0.5096763 0.0801916 0.0348796 0.0599618 0.36904 -0.0271277 -0.1137301 -0.0485184 0.035927 0.1386225 0.1215269 -0.1269147 0.0415995 -0.3383482 0.1640902 0.0812038 0.0866006 0.065481 0.0710154 -0.036646 0.0762074 0.0540722 -0.0646764 0.0544756 0.0211938 0.1258042 -0.0525631 0.0525245 0.7688118 0.276723 0.3404596 0.422575 0.2150957 0.2686863 0.6883654 0.3542363 0.2653024 -0.5401506 -0.1990686 -0.2037678 -0.2679585 -0.140646 -0.0039026 -0.1820072 0.0185285 -0.027252 0.214937 0.0202481 -0.0297931 0.1530921 0.0119744 0.1392537 0.1105168 0.1615205 0.116873 -0.1074412 0.1286328 0.181471 -0.0317704 -0.1408863 0.0056267 -0.0496351 -0.0382478 -0.1761014 0.1617085 -0.0693098 -0.1475271 0.0943402 0.058814 0.1864824 0.0665007 0.2151278 0.2688426 -0.0119235 -0.0731624 -0.0301116 -0.128465 -0.0648339 -0.0477848 -0.0568104 -0.0830295 0.0481908 0.0565928 0.0535646 -0.0832338 0.0170918 0.026798 0.08125 -0.0471968 0.067892 -0.0951106 0.0127149 0.0725258 -0.0308264 0.0944218 -0.0128443 0.0456669 -0.0417926 0.050162 -0.078217 0.0598952 -0.0288941 -0.0118904 -0.0112015 -0.0532151 -0.0444581 -0.0149074 -0.0523403 0.0446267 0.0654285 0.0397085 -0.0613931 0.0536558 0.0358379 0.0476916 -0.1185694 0.097762 -0.1070879 -0.1309923 0.0202816 0.152079 0.0314613 0.0583807 0.0071268 0.1712446 -0.0011119 -0.0134998 0.0040898 -0.1284534 -0.0774221 -0.0625824 -0.0566805 -0.0696952 -0.058559 -0.0645924 0.0613292 0.1225509 0.0112411 0.0083505 0.0049893 0.0896834 -0.0991392 0.0488872 -0.0939477 0.0170079 -0.1083714 -0.0054852 0.0507078 -0.0021434 0.1343933 -0.0242694 0.0410883 -0.0311635 0.0987641 -0.0059254 -0.075688 -0.0790767 -0.0803443 0.1013232 -0.0852871 -0.072702 -0.0861802 0.0521101 0.0687197 0.0233859 0.0540218 -0.021636 0.0613493 -0.1059132 0.0029337 -0.1116597 -0.041506 unknown
polarizability: 189.3567174|13.8950001|95.6777255|-10.6392502|25.8323144|111.1138947 unknown
InChI: InChI=1S/C8H11NS2/c1-2-7-10-11-8-5-3-4-6-9-8/h3-6H,2,7H2,1H3
charge 0 multiplicity 1
22 atoms
S  -1.791406 -1.483529 -0.582837
S  -0.168145 -0.899062 -2.042846
N  0.71656 0.547336 0.15468
C  -3.869057 -0.024309 0.599067
C  -2.683834 0.184155 -0.362265
C  -4.645896 1.296339 0.815244
C  1.106521 -0.119413 -0.959201
C  2.458446 -0.210954 -1.382705
C  3.441795 0.441704 -0.609333
C  3.052662 1.13691 0.56126
C  1.683164 1.152568 0.905548
H  -4.553196 -0.795562 0.194228
H  -3.49606 -0.399164 1.571748
H  -3.020502 0.519825 -1.356989
H  -1.936341 0.882672 0.044784
H  -5.056617 1.678182 -0.137745
H  -5.489861 1.143106 1.512013
H  -3.990278 2.078246 1.24075
H  2.725038 -0.786158 -2.274325
H  4.494565 0.391918 -0.906697
H  3.786512 1.646084 1.192882
H  1.332531 1.667509 1.807041
