program: Gaussian 09
title: 000194106
version: EM64L-G09RevD.01
frameworkgroup: C1[X(C16H17FN5O9PS)]
method: RPBEPBE
basis: SDD
operation: Freq
keyword: #p
keyword: freq=noraman
keyword: PBEPBE/SDD
title: #p freq=noraman PBEPBE/SDD
converged: NO YES NO NO
title: Mulliken charges:
elementType: S P F O O O O O O O O O N N N N N C C C C C C C C C C C C C C C C H H H H H H H H H H H H H H H H H
charge: 1.086427 1.398058 -0.364516 -0.291108 -0.475992 -0.458624 -0.531522 -0.535599 -0.669374 -0.572671 -0.465172 -0.469217 -0.191056 -0.084228 -0.199328 -0.062028 -0.623021 -0.204025 -0.151162 -0.042341 -0.050347 -0.268257 0.236061 -0.194526 -0.086612 0.157568 -0.336186 0.390610 -0.305222 -0.351029 -0.106566 -0.189784 -0.172186 0.267065 0.247064 0.265468 0.273549 0.252808 0.249294 0.401864 0.379833 0.283764 0.250928 0.393467 0.331890 0.414036 0.318078 0.277335 0.287634 0.288901
chargesum: 0.00000
title: Mulliken charges with hydrogens summed into heavy atoms:
elementType: S P F O O O O O O O O O N N N N N C C C C C C C C C C C C C C C C
charge: 1.086427 1.398058 -0.364516 -0.291108 -0.074128 -0.078791 -0.531522 -0.535599 -0.255339 -0.572671 -0.465172 -0.469217 -0.191056 -0.084228 -0.199328 -0.062028 0.102335 0.063040 0.095901 0.223127 0.223202 0.233845 0.236061 0.089238 -0.086612 0.157568 -0.085258 0.390610 0.012856 -0.073693 -0.106566 0.097850 0.116714
polarizability: 3.78448497e+02 -3.29814665e+01 2.55221854e+02 -3.01871370e+00 3.50893772e+01 2.25252392e+02
1716.lowfreq: -11.6553 -3.1574 -0.0013 -0.0007 0.0005 3.0561 16.7964 22.7246 26.9433
frequency: 16.6971 22.7110 26.9413 40.3752 49.2673 55.6408 65.4995 75.0933 79.5568 90.0290 93.7497 107.9355 120.3176 133.3304 145.3649 155.9325 159.7592 165.4815 175.9362 204.6022 218.1304 223.1413 238.9640 246.0629 248.9974 272.3922 282.1360 284.7855 294.5337 298.0885 306.0857 307.5444 334.8578 343.0789 347.1954 358.9417 386.2422 396.8172 411.0839 412.3873 449.9787 487.2771 516.5756 519.1238 521.7940 535.5996 549.8199 551.0333 557.1278 586.9860 594.7005 608.5148 613.8225 630.4622 647.1929 666.7973 672.6038 693.1348 705.6052 708.1486 718.4133 754.7198 764.4938 791.1980 821.1164 824.5736 826.1104 836.1016 846.7330 848.7899 852.4111 868.7843 877.5713 889.6233 909.2858 932.6807 945.8419 965.2401 968.3041 979.9774 981.2285 981.7574 998.0017 1002.7751 1011.0527 1035.2645 1041.6806 1047.5744 1056.8525 1072.1347 1074.3545 1116.8369 1116.9481 1147.7123 1169.7853 1184.4052 1191.2391 1200.8716 1206.0375 1223.2177 1247.6414 1267.1930 1271.7878 1283.3629 1292.5782 1294.8576 1298.8949 1322.6442 1329.2704 1340.0784 1350.5094 1361.3316 1375.0298 1385.1432 1385.3086 1387.3590 1408.7093 1431.8171 1451.3814 1460.4090 1466.7652 1479.6407 1537.1227 1577.4709 1589.2622 1594.2777 1650.0201 2865.1028 3000.0409 3009.2832 3022.0576 3027.8376 3036.3845 3099.6204 3155.7574 3165.5276 3169.6025 3171.3674 3185.0219 3261.5880 3415.8416 3441.2375 3604.3974 3628.1876
redmass: 10.4914 9.5023 10.5572 8.4243 6.8970 4.4228 6.6883 7.3986 8.5524 9.3959 8.6447 7.6125 7.8431 6.8288 8.2311 7.1599 8.4226 2.4860 7.1746 5.0956 6.1614 11.8386 5.3110 6.7424 5.4877 6.1289 5.0739 6.4340 3.0725 10.1776 4.5988 4.1458 8.0264 3.9722 9.6794 8.9506 7.0556 4.1170 3.0002 12.8345 10.4007 5.2973 3.2773 3.6763 6.8347 1.9287 3.5457 7.4224 3.6808 1.2689 4.9040 6.6031 7.4604 8.4789 4.0842 6.1152 7.5351 6.6275 4.0206 6.7446 8.6978 6.4785 1.1506 5.8901 4.0223 1.3774 5.5184 1.6160 2.2548 1.9405 16.3891 6.9676 3.3513 1.5431 2.0693 1.4261 2.7409 1.3430 2.6049 4.7177 3.4964 1.4458 16.5486 2.8270 1.4543 3.8498 2.3860 2.5110 4.6902 4.4124 9.6574 1.8481 1.5073 4.7095 1.7089 1.7165 1.3008 1.9430 1.1572 2.3162 1.3569 2.1656 1.2902 1.6270 3.2735 1.2580 1.3001 1.7139 1.4382 2.8708 1.3479 1.2980 2.0729 5.1775 5.9646 1.8628 3.6394 3.1627 1.0797 2.1494 1.3516 4.3028 8.8706 5.9827 7.7906 2.2372 2.0184 1.0699 1.0845 1.0858 1.0615 1.0865 1.0808 1.1093 1.0902 1.0896 1.0925 1.0975 1.0977 1.0984 1.0558 1.0646 1.0667 1.0962
irintensity: 0.4296 0.4691 0.0883 1.5628 0.0970 0.1269 0.2715 0.1010 0.3319 0.7136 9.9257 2.9901 4.5234 3.5246 12.1019 14.4558 6.2311 38.3098 3.0600 33.0853 2.3636 1.1048 3.5375 2.9359 18.9909 15.5214 11.8745 5.3314 60.7242 8.8835 9.0019 11.3637 37.3095 3.5878 15.8067 8.2618 17.6997 13.3555 0.1282 15.2573 152.6699 92.4559 108.6514 27.7699 93.4002 89.6167 2.7208 43.7554 18.7765 52.3797 30.0226 9.3541 1.7872 20.4765 49.8627 12.4157 41.0373 84.2524 5.7402 6.2902 213.7020 113.5521 168.5762 29.7046 13.6257 16.7312 157.3748 51.0551 43.4772 109.2591 118.5705 5.7311 60.9903 76.3275 136.5347 1.2862 10.9342 5.9972 19.7546 2.1303 57.2767 1.5448 69.5630 41.6421 98.4385 106.8250 37.7638 20.0679 60.6678 72.7581 113.4526 15.2199 2.9006 37.5267 158.4630 53.0954 48.4102 136.2658 29.1609 4.6429 15.0180 132.7973 4.9781 34.4822 20.6097 3.3650 8.3775 48.5876 33.3645 32.6295 24.1149 9.8723 33.2926 12.6878 8.6151 73.0287 16.1014 21.2454 16.8297 68.3944 268.0768 19.7508 48.3182 116.7962 12.9157 94.7153 481.2868 969.6900 17.8856 20.8430 5.5206 50.9049 33.0151 10.6846 7.2254 2.2717 13.0309 3.7918 2.3992 1.8004 474.5160 44.9799 121.1533 132.0930
temp: 298.150 k
press: 1.00000 atm
elementType: 16 15 9 8 8 8 8 8 8 8 8 8 7 7 7 7 7 6 6 6 6 6 6 6 6 6 6 6 6 6 6 6 6 1 1 1 1 1 1 1 1 1 1 1 1 1 1 1 1 1
symmnumber: 1
zpe: 904331.4 jmol-1
zpe.correction: 0.344442 hartree
zpe.thermalcorrener: 0.375794 hartree
zpe.thermalcorrenthalpy: 0.376738 hartree
zpe.thermalcorrgfe: 0.280614 hartree
zpe.sumelectzpe: -2407.192374 hartree
zpe.sumelectthermal: -2407.161023 hartree
zpe.sumelectthermalent: -2407.160078 hartree
zpe.sumelectthermalfe: -2407.256202 hartree
dipole: 2.9440 -6.1670 -1.0714
dipole: 6.9171
quadrupole: -246.2913 -185.4430 -212.6836
quadrupole: -11.0451 -5.9592 4.4915
quadrupole: -31.4854 29.3630 2.1224 -11.0451 -5.9592 4.4915
hfenergy: -2407.5368161 hartree
pointgroup: C01 [X(C16H17F1N5O9P1S1)]
dipole: -2.3166464 1.414241 -0.1978362 debye
polarizability: 366.0412839|39.1029041|274.4005892|41.0215852|-12.5896306|218.4808708 unknown
InChI: InChI=1S/C16H17FN5O9PS/c17-33(27,28)9-3-1-8(2-4-9)31-32(25,26)29-5-10-12(23)13(24)16(30-10)22-7-21-11-14(18)19-6-20-15(11)22/h1-4,6-7,10,12-13,16,23-25H,5,18H2
charge 0 multiplicity 1
50 atoms
S  3.782146 3.379832 0.914515
P  -3.159678 1.238154 1.411983
F  4.499392 1.804561 0.13829
O  -2.220792 -1.019239 -2.180747
O  -1.773902 -4.196418 -0.416024
O  -3.917989 -3.689798 -1.922711
O  -3.32437 -0.126664 0.42143
O  -2.137181 2.361642 0.518242
O  -4.654738 2.01339 1.119723
O  -2.704509 0.931644 2.892792
O  4.202308 4.547605 -0.103132
O  4.291615 3.325098 2.436855
N  -0.079095 -1.517476 -1.263853
N  1.664483 -0.059706 -0.968821
N  0.791333 -3.466313 0.016743
N  3.000307 -3.020571 0.979515
N  4.127137 -0.963637 0.744899
C  -2.107597 -2.796395 -0.533763
C  -3.582026 -2.642591 -0.963115
C  -1.357743 -2.097513 -1.708173
C  -3.614536 -1.283489 -1.697757
C  -4.076494 -0.087319 -0.875111
C  0.865748 -2.193642 -0.491018
C  0.454439 -0.247086 -1.52917
C  1.93758 -1.278446 -0.3169
C  3.042624 -1.734283 0.468763
C  1.911221 -3.796215 0.735902
C  -0.742319 2.521926 0.674708
C  -0.021564 2.090591 1.817219
C  -0.109916 3.202934 -0.394345
C  1.964847 3.012715 0.803694
C  1.36497 2.334165 1.877057
C  1.273068 3.450423 -0.339264
H  -1.925551 -2.233294 0.401085
H  -4.266024 -2.667497 -0.093947
H  -1.172768 -2.823682 -2.52454
H  -4.268138 -1.372849 -2.585857
H  -3.852657 0.852699 -1.409078
H  -5.154542 -0.144925 -0.645351
H  -0.769789 -4.220558 -0.184567
H  -3.37907 -4.486368 -1.651556
H  -0.090371 0.478329 -2.125587
H  1.929413 -4.80082 1.167754
H  4.201425 0.005492 0.411251
H  4.87429 -1.370473 1.306488
H  -4.816575 2.861757 1.604122
H  -0.528519 1.581461 2.642476
H  -0.707405 3.523891 -1.251561
H  1.949886 2.020145 2.747016
H  1.790225 3.967512 -1.152678
