program: Gaussian 09
title: 000194105
version: EM64L-G09RevD.01
frameworkgroup: C1[X(C17H21NO)]
method: RPBEPBE
basis: SDD
operation: Freq
keyword: #p
keyword: freq=noraman
keyword: PBEPBE/SDD
title: #p freq=noraman PBEPBE/SDD
converged: NO YES NO NO
title: Mulliken charges:
elementType: O N C C C C C C C C C C C C C C C C C H H H H H H H H H H H H H H H H H H H H H
charge: -0.210198 -0.019229 -0.086297 -0.140744 -0.128342 -0.480325 -0.486806 -0.543609 -0.474954 -0.488815 -0.597627 -0.270360 0.159114 0.401233 -0.396484 -0.404379 -0.253058 -0.232358 -0.246131 0.238171 0.273300 0.216207 0.217660 0.210597 0.212079 0.225932 0.229552 0.214132 0.235636 0.229770 0.228568 0.224642 0.235478 0.247364 0.257565 0.240895 0.279575 0.226239 0.227007 0.228998
chargesum: 0.00000
title: Mulliken charges with hydrogens summed into heavy atoms:
elementType: O N C C C C C C C C C C C C C C C C C
charge: -0.210198 -0.019229 0.151874 0.132557 0.087865 -0.052068 -0.048795 -0.099925 -0.009547 -0.035605 -0.114786 -0.012795 0.159114 0.401233 -0.155589 -0.124804 -0.026819 -0.005351 -0.017133
polarizability: 2.05999805e+02 -7.02095106e+00 1.79225453e+02 -1.71458772e+01 -4.60142091e+00 1.40635227e+02
1716.lowfreq: -25.8805 -3.1011 -1.5794 -0.0005 -0.0003 -0.0002 20.5697 32.3341 68.9808
frequency: 13.5930 30.9416 68.9683 99.2181 134.2209 181.5545 211.1108 219.7559 254.0953 279.4988 302.9886 344.1970 382.7670 405.7750 409.6031 421.9471 442.7201 470.4730 498.7418 518.7955 537.3760 581.6972 603.4434 616.9474 638.4085 668.5037 705.8881 722.0990 736.1104 767.7242 790.5903 796.4279 804.3118 823.1632 838.5877 858.7720 871.4828 903.4397 923.1824 938.2430 968.4244 971.1739 982.0214 986.7093 990.3405 999.2033 1002.0967 1015.5452 1034.4922 1038.6727 1059.4147 1075.9356 1083.7087 1090.0246 1113.5707 1118.7808 1139.9481 1162.5081 1174.0156 1177.1509 1186.0027 1198.3021 1202.9865 1208.9433 1229.3867 1237.4250 1249.5999 1255.3375 1261.3637 1281.1395 1303.4978 1308.1353 1311.1731 1312.8388 1318.7613 1325.0786 1328.7312 1332.2781 1341.4751 1347.5532 1374.6465 1377.1744 1430.2589 1434.2421 1463.9728 1470.5045 1473.6899 1482.5375 1488.0875 1497.3982 1587.9622 1606.7900 1618.6260 2964.8300 2972.7986 2977.5764 2980.2970 2986.2591 2998.4426 3002.7005 3006.7216 3014.7698 3020.6335 3034.1214 3036.7697 3051.1253 3060.8720 3064.7217 3069.2381 3121.7908 3131.4557 3146.0295 3154.5793 3165.2723
redmass: 4.2292 3.7968 4.2943 3.3345 4.8584 3.5411 3.9094 2.5224 2.8904 4.8819 2.0783 2.9023 3.1324 2.9704 3.0306 3.2979 2.9863 3.0783 3.2406 3.4286 4.1649 3.1396 7.5703 6.3529 3.5802 4.5571 2.5197 2.1469 2.1101 2.5117 1.4860 3.0860 2.3713 1.8776 2.1675 1.2433 3.0173 2.3496 1.5892 2.1244 1.9072 2.4141 1.4627 2.3372 5.1970 1.4007 2.1816 2.8879 2.2753 2.6836 2.5691 2.2954 1.7166 1.7313 1.5238 2.0498 1.6195 1.5434 1.0602 1.5661 1.9145 1.4271 1.1279 1.4572 1.4338 1.5156 1.4006 1.7450 1.4496 1.5638 1.3607 1.3383 1.3157 1.3428 1.3429 1.3340 1.3650 1.3246 1.3942 1.4352 3.0903 1.7680 1.0819 2.2460 1.0801 1.0820 1.0868 1.8801 1.0960 1.1476 5.8826 6.3493 9.2132 1.0687 1.0806 1.0790 1.0601 1.0602 1.0615 1.0672 1.0663 1.0784 1.0846 1.1030 1.1033 1.0949 1.1010 1.1027 1.1051 1.0845 1.0881 1.0924 1.0950 1.1007
irintensity: 2.4515 0.0213 0.2564 3.1991 1.5454 0.5934 1.2137 1.1884 0.2866 1.0989 2.2780 0.1363 0.7378 0.8426 2.2847 0.0688 0.8952 2.0188 25.5811 7.2256 2.1252 2.6038 4.8469 0.1813 1.1279 4.3971 26.4433 24.6677 36.5386 20.7747 10.4119 6.2191 4.8889 6.1332 2.1987 0.2681 1.6051 0.9993 3.4412 6.1063 5.4706 25.4306 0.6728 12.9256 0.5967 0.5992 9.5879 0.2434 11.8231 17.9861 8.4783 0.3410 5.7083 17.1520 13.5967 16.9434 2.3996 1.9593 1.3057 2.0202 33.6757 2.4340 2.2437 2.3864 5.2827 30.8734 2.3042 16.9214 10.7578 5.1406 2.6544 2.1142 0.8801 4.9516 2.7666 1.0461 2.8069 2.7975 2.4612 1.4086 1.4294 2.4685 12.7152 10.8033 1.5041 17.2162 10.0719 45.3663 20.1233 11.6067 2.3533 47.3721 121.3226 5.7582 7.4405 18.4518 25.3455 21.8001 78.8938 7.8630 89.9688 47.6184 37.8061 6.9907 15.8843 24.5375 10.8681 58.5924 94.6930 0.9372 8.7020 29.5865 16.9292 20.2052
temp: 298.150 k
press: 1.00000 atm
elementType: 8 7 6 6 6 6 6 6 6 6 6 6 6 6 6 6 6 6 6 1 1 1 1 1 1 1 1 1 1 1 1 1 1 1 1 1 1 1 1 1
symmnumber: 1
zpe: 902032.2 jmol-1
zpe.correction: 0.343566 hartree
zpe.thermalcorrener: 0.358860 hartree
zpe.thermalcorrenthalpy: 0.359804 hartree
zpe.thermalcorrgfe: 0.299927 hartree
zpe.sumelectzpe: -788.953245 hartree
zpe.sumelectthermal: -788.937951 hartree
zpe.sumelectthermalent: -788.937006 hartree
zpe.sumelectthermalfe: -788.996884 hartree
dipole: -2.2517 -2.0718 -0.6472
dipole: 3.1275
quadrupole: -107.5768 -120.9419 -113.0090
quadrupole: -8.5919 -0.4773 2.6120
quadrupole: 6.2658 -7.0993 0.8336 -8.5919 -0.4773 2.6120
hfenergy: -789.2968106 hartree
pointgroup: C01 [X(C17H21N1O1)]
dipole: 0.8533298 0.8711237 -0.1642662 debye
polarizability: 202.7993936|-5.9668838|178.364713|22.9911192|5.3781165|144.6963787 unknown
InChI: InChI=1S/C17H21NO/c19-17-11-14-13-6-8-18(9-7-13)16(14)10-15(17)12-4-2-1-3-5-12/h1-5,13-16H,6-11H2
charge 0 multiplicity 1
40 atoms
O  -0.920887 -3.196133 -0.212915
N  2.188294 1.23205 1.144994
C  1.36184 -0.341923 -0.67445
C  0.974067 0.572047 0.557632
C  2.847425 -0.028599 -1.036195
C  2.986672 1.506233 -1.244845
C  3.795502 -0.442807 0.122831
C  0.147734 -0.185397 1.620544
C  2.712785 2.209254 0.137453
C  3.268861 0.236243 1.438045
C  1.098453 -1.842716 -0.407318
C  -0.968993 -1.049509 0.977459
C  -0.321993 -2.124433 0.074773
C  -2.061523 -0.247022 0.223842
C  -2.323775 1.110711 0.546276
C  -2.883906 -0.875293 -0.748981
C  -3.364177 1.822577 -0.092715
C  -3.920474 -0.162589 -1.391551
C  -4.1661 1.191479 -1.069456
H  0.734703 -0.045735 -1.539196
H  0.349359 1.402245 0.179877
H  3.124298 -0.564773 -1.963421
H  2.266669 1.848414 -2.013029
H  4.000983 1.746336 -1.615805
H  4.822166 -0.105233 -0.115578
H  3.842911 -1.542426 0.228392
H  -0.26766 0.536343 2.345161
H  0.801293 -0.856484 2.210014
H  3.638375 2.650277 0.550254
H  1.975535 3.025512 0.030447
H  2.871251 -0.514702 2.143098
H  4.081397 0.768722 1.964312
H  1.778582 -2.213824 0.38871
H  1.296581 -2.464444 -1.29929
H  -1.493624 -1.612888 1.777383
H  -1.728072 1.622462 1.309301
H  -2.720182 -1.929367 -0.994242
H  -3.547777 2.869013 0.17697
H  -4.540347 -0.669738 -2.139725
H  -4.972144 1.743218 -1.56596
