program: Gaussian 09
title: 000194069
version: EM64L-G09RevD.01
frameworkgroup: C1[X(C10H7F3N2O)]
method: RPBEPBE
basis: SDD
operation: Freq
keyword: #p
keyword: freq=noraman
keyword: PBEPBE/SDD
title: #p freq=noraman PBEPBE/SDD
converged: NO YES NO NO
title: Mulliken charges:
elementType: F F F O N N C C C C C C C C C C H H H H H H H
charge: -0.163803 -0.151859 -0.163777 -0.253971 -0.437452 -0.691273 0.239652 0.352961 0.269749 -0.325065 -0.611367 -0.421870 0.577709 0.060562 0.245127 -0.485794 0.258198 0.227759 0.331080 0.280614 0.227993 0.319350 0.315479
chargesum: 0.00000
title: Mulliken charges with hydrogens summed into heavy atoms:
elementType: F F F O N N C C C C C C C C C C
charge: -0.163803 -0.151859 -0.163777 -0.253971 -0.106372 -0.056445 0.239652 0.352961 0.269749 -0.066867 -0.383608 -0.141256 0.577709 0.060562 0.245127 -0.257801
polarizability: 1.99794398e+02 -3.90071270e+01 1.61929316e+02 -4.61114495e-03 -4.13215827e-03 5.72686248e+01
1716.lowfreq: -2.7696 -0.0006 0.0003 0.0009 5.8955 8.6655 53.5744 78.3702 104.0154
frequency: 53.5458 78.3684 104.0149 141.1532 145.8581 241.9987 250.8766 259.8776 285.1731 310.2277 314.2459 389.2109 405.2247 429.1694 430.3537 445.2010 463.6439 468.2210 483.4152 561.7356 614.7566 615.6115 644.4659 652.4421 670.2512 723.8233 746.4680 747.0242 793.1824 811.1296 849.0689 860.5989 878.6410 937.1409 945.8835 976.3171 982.7359 1035.5639 1052.6414 1131.1076 1185.3786 1219.3215 1230.6052 1268.5313 1297.0094 1343.2072 1373.4527 1407.4160 1428.2663 1475.7675 1531.7455 1551.6602 1587.5423 1643.5890 1646.2408 1655.5191 3126.1824 3140.2401 3178.7485 3204.7795 3512.7978 3563.3156 3702.4366
redmass: 14.8740 5.5116 6.4154 9.3076 6.0835 7.7743 5.3164 4.9600 8.7022 9.6754 6.1821 4.4951 1.0330 1.6040 9.6842 2.5054 4.5403 12.2172 4.9764 6.7020 12.0109 4.5510 2.3826 2.7843 8.1531 5.6834 2.4485 2.0576 6.2440 1.6038 1.9875 7.2517 1.5041 5.2832 1.4750 2.5821 6.0949 4.9809 1.7027 3.0109 1.6198 1.7897 2.5668 2.2191 1.9332 2.6050 1.8865 3.0647 8.3252 4.5077 3.9739 6.4957 6.2027 1.9628 2.9151 3.0421 1.0915 1.0896 1.0952 1.0927 1.0765 1.0453 1.1041
irintensity: 0.9511 0.2209 0.2139 2.4607 3.5525 1.5547 5.8461 0.3586 1.4870 0.0211 0.0367 10.5946 1.2340 209.7587 0.3459 101.4946 1.6154 7.5608 9.2427 1.6119 20.2083 2.1736 30.1811 0.3421 1.5199 9.0334 21.8703 24.4171 4.4672 12.6873 84.6720 30.4185 75.9091 24.8950 22.0712 0.9206 198.4471 155.2132 40.0485 138.3772 26.1822 49.1142 143.6786 22.0815 17.1850 42.5428 3.5501 66.4551 42.3567 19.8164 82.3022 29.0917 41.3091 520.9334 426.7168 242.0664 12.6296 11.3320 4.1061 7.1023 28.0027 133.1928 26.4841
temp: 298.150 k
press: 1.00000 atm
elementType: 9 9 9 8 7 7 6 6 6 6 6 6 6 6 6 6 1 1 1 1 1 1 1
symmnumber: 1
zpe: 413932.6 jmol-1
zpe.correction: 0.157659 hartree
zpe.thermalcorrener: 0.170932 hartree
zpe.thermalcorrenthalpy: 0.171876 hartree
zpe.thermalcorrgfe: 0.117950 hartree
zpe.sumelectzpe: -868.424275 hartree
zpe.sumelectthermal: -868.411001 hartree
zpe.sumelectthermalent: -868.410057 hartree
zpe.sumelectthermalfe: -868.463983 hartree
dipole: 8.3182 -2.0494 -0.0001
dipole: 8.5669
quadrupole: -67.4803 -100.8721 -95.9879
quadrupole: 2.2425 0.0320 -0.0224
quadrupole: 20.6331 -12.7587 -7.8744 2.2425 0.0320 -0.0224
hfenergy: -868.5819335 hartree
pointgroup: C01 [X(C10H7F3N2O1)]
dipole: -3.3072641 -0.6423766 0.0978279 debye
dipolederiv: -0.3942378 0.0761161 -0.0453254 0.1297247 -0.5932893 -0.2782273 -0.0189749 -0.231704 -0.5975297 -0.8768271 -0.0034855 0.0130587 0.0640189 -0.3357321 0.0008242 0.0106418 0.0022497 -0.2732159 -0.3922892 0.0886595 0.0296903 0.1421441 -0.5561262 0.2691325 -0.0004269 0.2245759 -0.6361186 -0.6012701 -0.2136523 0.0126008 -0.6622603 -1.346271 0.0503031 0.0312191 0.0429577 -0.3797798 -0.74582 -0.5446551 0.0309793 -0.247559 -0.5504074 0.0153701 0.019266 0.0216334 -0.2947559 -1.83545 -0.3482207 0.0388419 -0.0768415 -0.1226668 -0.0201804 0.031234 -0.0134605 -0.7174166 -0.844144 -0.3069848 0.0294376 0.0095608 -0.4062854 0.0135471 0.0177923 0.0207193 -0.0382645 0.7845508 0.3139036 -0.0259078 0.0158952 0.5189155 -0.0138687 -0.0148396 -0.0203507 0.1567072 0.733127 0.5178458 -0.0383978 0.550027 0.0880408 -0.0201946 -0.0399031 -0.0199688 -0.1274456 0.5672035 0.2816108 -0.0246389 0.3164322 0.32534 -0.0216097 -0.0258415 -0.0207205 -0.0666728 -0.6140131 -0.2450355 0.0162111 -0.4842025 -0.184767 0.0066402 0.0247992 0.0009583 -0.3017829 -0.1908223 0.1776476 -0.0051693 -0.6550057 -0.6644436 0.0347053 0.0262982 0.0161036 -0.1290732 1.9326654 0.3691605 -0.0535714 -0.0422133 0.1476198 0.0022442 -0.038636 -0.0071664 0.1866606 0.7794468 0.2762232 -0.0232875 0.8373205 1.6105567 -0.0711538 -0.0455604 -0.0604354 0.2061219 1.6939493 -0.2972765 0.0068411 -0.4205857 1.5476393 0.0076446 0.0108931 0.0051555 1.5015727 -0.7453648 -0.227065 0.0195791 0.4661887 0.0873387 -0.0227663 -0.0062392 -0.007523 -0.2432167 0.0797744 0.0714974 -0.0012611 0.0489405 0.0117084 0.0036596 -0.0004459 0.0031517 0.1406834 -0.0084111 0.056784 0.0022763 0.0941777 -0.0559148 0.0069057 0.0009454 0.0077108 0.186588 0.1127364 -0.0048255 0.0045505 0.003782 0.1798925 0.0048927 0.004287 0.0052956 0.3136451 0.0679566 0.0198702 0.0015297 -0.030414 0.0976131 0.0033808 0.0033539 0.0022816 0.1710559 -0.003548 -0.1029481 0.007804 -0.0790377 -0.0534478 0.0101412 0.0070605 0.010848 0.1721794 0.2515613 0.0391145 0.0014453 0.0866488 0.1554906 0.0063456 -0.0012918 0.0070668 0.3848882 0.2492259 0.0057157 0.0027136 -0.0667412 0.0991961 0.0122637 0.0043689 0.0106214 0.3851699 unknown
polarizability: 203.4347505|36.8188925|158.0152542|-4.6394475|-4.5696242|57.5423334 unknown
InChI: InChI=1S/C10H7F3N2O/c11-10(12,13)7-4-9(16)15-8-3-5(14)1-2-6(7)8/h1-4,15H,14H2
charge 0 multiplicity 1
23 atoms
F  1.881637 -2.183033 -1.110787
F  3.482241 -0.982883 -0.053721
F  1.930319 -2.100361 1.155495
O  1.454723 3.559558 -0.180925
N  -0.406773 2.155612 -0.08478
N  -4.478681 -0.522743 0.106067
C  -0.228436 -0.275225 0.001386
C  -1.041835 0.911946 -0.024579
C  1.210967 -0.095543 -0.037324
C  -0.901222 -1.533251 0.062466
C  -2.452139 0.835401 0.009632
C  1.795958 1.155657 -0.096554
C  -3.094771 -0.425779 0.070785
C  0.991883 2.37789 -0.123158
C  2.111816 -1.305799 -0.012524
C  -2.292637 -1.615522 0.09664
H  -0.318711 -2.458017 0.083471
H  -3.04785 1.756052 -0.011114
H  -0.97471 3.008676 -0.104394
H  2.878658 1.288006 -0.125354
H  -2.783146 -2.593981 0.144108
H  -4.93425 -1.429833 0.148441
H  -5.065239 0.306669 0.087222
