program: Gaussian 09
title: 000194066
version: EM64L-G09RevD.01
frameworkgroup: C1[X(C19H24O3)]
method: RPBEPBE
basis: SDD
operation: Freq
keyword: #pfreq=noraman
keyword: PBEPBE/SDD
title: #p freq=noraman PBEPBE/SDD
converged: YES YES NO NO
title: Mulliken charges:
elementType: O O O C C C C C C C C C C C C C C C C C C C H H H H H H H H H H H H H H H H H H H H H H H H
charge: -0.179627 -0.330616 -0.423579 -0.149895 0.298870 -0.078067 -0.177101 -0.519957 -0.549457 -0.484947 -0.519215 0.042462 -0.507749 0.323665 -0.794388 -0.567021 0.180905 -0.371209 -0.023947 -0.396520 0.133059 -0.516204 0.219483 0.229981 0.206449 0.215362 0.226420 0.231590 0.216547 0.223228 0.202672 0.217340 0.221748 0.247889 0.247293 0.234148 0.227348 0.241870 0.205050 0.256350 0.224209 0.249610 0.371796 0.227925 0.230256 0.235974
chargesum: 0.00000
title: Mulliken charges with hydrogens summed into heavy atoms:
elementType: O O O C C C C C C C C C C C C C C C C C C C
charge: -0.179627 -0.330616 -0.051784 0.069588 0.298870 0.151914 0.029348 -0.078175 -0.101319 -0.059047 -0.080126 0.042462 -0.012568 0.323665 -0.091022 -0.105621 0.180905 -0.147000 -0.023947 -0.146910 0.133059 0.177951
polarizability: 2.71259165e+02 1.10591128e+00 2.09132474e+02 6.70558798e+00 9.87130770e-01 1.37977053e+02
1716.lowfreq: -6.5285 -0.0008 -0.0006 0.0002 8.7397 10.4358 34.4685 43.1735 70.6765
frequency: 34.4107 43.1614 70.6484 75.8974 104.3555 127.1693 130.7654 148.6510 157.2623 186.9782 191.1799 216.9888 232.2299 236.9193 251.6353 274.1021 290.8003 297.9119 321.5881 359.7693 368.6706 377.9718 404.3508 441.3168 476.4591 481.5990 500.5818 514.8219 526.1137 545.1344 565.9753 570.3735 580.8265 591.3773 618.5962 635.9480 669.3899 701.1889 743.2627 761.6435 808.4082 817.3523 821.4780 830.5000 853.3527 859.9811 894.0640 920.4408 930.1978 940.6890 945.3967 964.7669 982.6734 996.1381 1006.8604 1014.0749 1032.8435 1049.4290 1059.6925 1076.6352 1087.8261 1111.4577 1116.6875 1127.4768 1130.4884 1144.2901 1152.7981 1158.6191 1165.8114 1170.6109 1193.5955 1200.2095 1207.3985 1220.3720 1238.4459 1243.3255 1252.0122 1253.3574 1260.3249 1284.8579 1292.9993 1296.2396 1310.2302 1315.1919 1323.5561 1328.8634 1334.1123 1341.5089 1352.3704 1375.0416 1380.9872 1386.3622 1423.2438 1428.5413 1439.1791 1455.1154 1458.2270 1462.9345 1469.2618 1470.7618 1472.0975 1474.3844 1480.9557 1486.4616 1488.3883 1603.4810 1609.8249 1653.5946 2901.3858 2905.5364 2948.5371 2956.6089 2971.4875 2974.7826 2978.4177 2985.1780 2989.1960 2996.9940 3002.8836 3026.3264 3038.3838 3039.2684 3049.1116 3055.7907 3066.6579 3070.3873 3079.5469 3092.1684 3114.9192 3144.3745 3171.8170 3460.8976
redmass: 4.5977 4.3660 2.2196 4.0576 4.6372 2.1993 3.1701 1.5578 1.9855 1.9432 2.4294 2.1295 3.9282 2.8007 3.6818 2.6041 3.9461 3.8481 3.4678 2.7611 2.8135 3.5702 3.9716 3.8569 3.0973 4.9695 3.1650 3.7574 3.1670 2.3347 3.4802 4.0780 3.9803 1.1271 3.9585 3.4907 3.9109 2.7531 5.0078 4.3100 1.8849 1.8371 1.9886 1.8023 2.2868 2.0307 2.8007 2.3008 3.2342 1.4690 1.8108 2.5140 2.2259 2.0462 2.0828 2.0291 2.1113 2.4255 2.7580 2.7517 2.0845 1.2551 2.1513 1.6094 2.1120 1.4881 1.6086 1.5222 1.7056 1.7479 1.6323 1.5731 2.3460 1.7231 1.5425 1.5986 1.6102 1.5780 1.6175 1.4208 1.4327 1.3522 2.4697 1.4086 1.3410 1.5698 1.4933 1.4515 1.5180 1.2766 1.4677 3.1170 2.1352 1.0814 1.6360 1.1479 1.0731 1.2182 1.0884 1.0851 1.0810 1.2277 1.6909 1.0661 1.0763 6.2436 7.8249 12.0630 1.0803 1.0795 1.0671 1.0812 1.0309 1.0633 1.0623 1.0574 1.0409 1.0589 1.0660 1.0915 1.1014 1.0979 1.1020 1.0985 1.1037 1.1020 1.0993 1.0984 1.1023 1.0873 1.0960 1.0635
irintensity: 0.7093 0.6857 4.2507 3.7026 0.7357 0.7624 1.1740 1.8259 0.6433 1.5994 0.9468 0.7239 2.2184 1.9474 1.4791 0.4006 12.1108 11.1922 5.0737 0.5317 1.3416 5.4041 0.6897 0.6820 0.6318 1.0652 3.9270 0.7317 5.7900 3.3940 2.1012 7.9600 0.6518 117.9101 21.6077 3.3709 6.1370 6.1077 0.8000 1.9124 30.0137 6.9233 5.9094 12.1704 2.8764 3.6699 7.9248 23.3617 13.5457 3.0520 12.4433 35.3420 21.6353 17.1096 3.1242 10.8006 22.1214 13.3490 25.8053 18.9008 14.9489 1.3454 0.7533 6.5191 8.6199 12.9326 13.6683 0.3590 87.5139 65.1121 25.2474 9.2023 64.0894 12.6403 3.1373 9.9279 7.4252 7.2170 2.3146 3.8281 2.6706 1.9664 41.8714 1.0557 2.9422 9.6830 4.1359 4.5361 4.5232 19.9245 4.3011 3.9470 45.5634 18.3900 11.2353 27.3872 5.7770 14.7631 11.1736 2.6744 5.1478 19.2138 87.6515 12.7715 10.3353 0.4427 28.6978 195.0173 7.4124 24.1674 24.6979 13.2611 65.4979 41.6990 30.0694 18.6625 27.9184 32.9278 12.9067 21.8281 26.1726 50.3907 46.2168 13.1547 35.9627 40.1835 18.8565 27.7620 26.6854 10.8655 11.0009 62.3825
temp: 298.150 k
press: 1.00000 atm
elementType: 8 8 8 6 6 6 6 6 6 6 6 6 6 6 6 6 6 6 6 6 6 6 1 1 1 1 1 1 1 1 1 1 1 1 1 1 1 1 1 1 1 1 1 1 1 1
symmnumber: 1
zpe: 1018545.7 jmol-1
zpe.correction: 0.387944 hartree
zpe.thermalcorrener: 0.408186 hartree
zpe.thermalcorrenthalpy: 0.409130 hartree
zpe.thermalcorrgfe: 0.340149 hartree
zpe.sumelectzpe: -962.435511 hartree
zpe.sumelectthermal: -962.415269 hartree
zpe.sumelectthermalent: -962.414325 hartree
zpe.sumelectthermalfe: -962.483305 hartree
dipole: 1.2647 3.9370 1.4783
dipole: 4.3914
quadrupole: -160.2049 -125.6220 -128.7809
quadrupole: -0.0227 6.4912 3.3404
quadrupole: -22.0023 12.5806 9.4217 -0.0227 6.4912 3.3404
hfenergy: -962.8234547 hartree
pointgroup: C01 [X(C19H24O3)]
dipole: 0.4738263 1.5301255 0.6474824 debye
polarizability: 271.1918753|1.724561|208.9598907|6.9782766|4.0859173|138.2169257 unknown
InChI: InChI=1S/C19H24O3/c1-19-10-9-12-11-5-7-16(20)18(22-2)14(11)4-3-13(12)15(19)6-8-17(19)21/h5,7,12-13,15,20H,3-4,6,8-10H2,1-2H3
charge 0 multiplicity 1
46 atoms
O  -5.52952 -0.977979 -0.089964
O  4.294707 1.486072 0.007996
O  5.501165 -0.94027 -0.07491
C  -2.363211 0.662024 -0.402268
C  -3.124424 -0.468495 0.357715
C  -0.863254 0.671311 -0.061824
C  -0.265825 -0.706849 -0.490888
C  -2.560328 -1.84158 -0.062883
C  -3.246461 1.921039 -0.193171
C  -1.024585 -1.896967 0.171174
C  -0.06482 1.805507 -0.736495
C  -4.581464 -0.158482 -0.036175
C  -4.687354 1.353288 -0.35192
C  1.259891 -0.754198 -0.299459
C  -3.09153 -0.316581 1.91386
C  1.373757 1.82909 -0.182045
C  2.021927 0.448332 -0.172836
C  1.950641 -1.995056 -0.329938
C  3.428487 0.346586 -0.063529
C  3.354868 -2.083449 -0.251766
C  4.103386 -0.898454 -0.127943
C  4.34873 2.152764 1.328362
H  -2.440193 0.407763 -1.48645
H  -0.741112 0.788606 1.03701
H  -0.458108 -0.786897 -1.587304
H  -2.7745 -2.007945 -1.138058
H  -3.060792 -2.657785 0.490741
H  -3.031915 2.717646 -0.926224
H  -3.09686 2.351903 0.814832
H  -0.795146 -1.915845 1.254871
H  -0.653338 -2.854961 -0.237437
H  -0.546045 2.785017 -0.552734
H  -0.05168 1.6478 -1.83423
H  -5.052685 1.456073 -1.39235
H  -5.4460 1.829981 0.29457
H  -2.072358 -0.4568 2.310499
H  -3.451367 0.6716 2.252156
H  -3.743018 -1.086028 2.365842
H  1.335945 2.226767 0.854656
H  2.013671 2.526043 -0.755594
H  1.383549 -2.925035 -0.435059
H  3.874282 -3.044858 -0.296214
H  5.81866 0.00462 -0.107354
H  4.572161 1.423184 2.130077
H  3.39668 2.66684 1.551607
H  5.158686 2.894958 1.252955
