program: Gaussian 09
title: 000194061
version: EM64L-G09RevD.01
frameworkgroup: C1[X(C15H26O4S2)]
method: RPBEPBE
basis: SDD
operation: Freq
keyword: #p
keyword: freq=noraman
keyword: PBEPBE/SDD
title: #p freq=noraman PBEPBE/SDD
converged: YES YES NO NO
title: Mulliken charges:
elementType: S S O O O O C C C C C C C C C C C C C C C H H H H H H H H H H H H H H H H H H H H H H H H H H
charge: 0.167752 0.176223 -0.273347 -0.186612 -0.182940 -0.238085 -0.419671 -0.674266 -0.251449 -0.411651 -0.055424 -0.352701 -0.414852 -0.489211 -0.353276 -0.348882 -0.055838 0.276378 -0.679823 -0.682593 -0.682268 0.356492 0.296944 0.285231 0.258783 0.246272 0.233725 0.238683 0.213100 0.230015 0.253287 0.229287 0.238284 0.237986 0.209526 0.232358 0.210601 0.227775 0.225062 0.211893 0.210172 0.209272 0.212126 0.223578 0.208824 0.209262 0.223997
chargesum: 0.00000
title: Mulliken charges with hydrogens summed into heavy atoms:
elementType: S S O O O O C C C C C C C C C C C C C C C
charge: 0.167752 0.176223 -0.273347 -0.186612 -0.182940 -0.238085 -0.063179 -0.092092 0.253606 0.060757 -0.055424 0.090414 0.067721 -0.012940 0.088608 0.089494 -0.055838 0.276378 -0.032695 -0.037618 -0.040185
polarizability: 2.73679553e+02 7.89730332e+00 2.01256528e+02 9.44168686e+00 -1.23852913e+01 1.73103512e+02
1716.lowfreq: -14.5014 -3.3448 -0.0024 -0.0022 -0.0021 4.4583 5.9258 12.2841 19.7342
frequency: -13.7124 12.0585 19.6511 24.8808 27.4571 35.2287 47.3345 48.4254 52.5429 60.0731 71.8559 79.7825 80.9471 92.8682 107.0283 137.8920 145.4621 169.2557 178.7474 195.3446 222.4527 230.2530 236.0855 236.7552 259.2454 265.5916 298.4040 326.4719 328.8968 363.3446 365.6138 367.0961 413.4874 459.1745 462.5517 510.9909 515.8414 526.6264 556.1920 619.1951 685.7856 717.4225 725.6074 732.7264 740.2589 740.8209 742.3209 852.1971 864.8154 866.2055 869.9436 876.8731 881.2339 884.3322 890.1145 934.8256 957.9030 1001.5928 1010.2293 1042.5598 1055.0865 1055.1922 1055.5697 1088.2862 1088.3342 1090.3461 1108.3700 1113.6360 1115.2399 1116.9019 1136.6881 1173.8059 1213.2711 1218.4998 1218.8185 1221.7061 1253.3418 1271.8433 1272.5419 1278.4433 1281.6159 1296.7374 1299.8046 1300.1780 1336.3005 1343.5893 1349.7648 1356.1937 1365.7706 1393.1360 1393.4869 1394.3867 1415.5559 1437.6173 1439.3322 1442.6761 1458.8476 1474.3923 1474.9300 1475.2076 1478.5919 1479.4687 1479.8396 1486.2065 1486.2386 1486.2996 1629.6872 1634.5870 1645.8573 2971.6383 2974.0822 2974.2221 2975.6092 2975.7116 2982.3396 2998.9232 2999.2345 3001.9687 3005.7266 3019.3889 3031.1563 3032.3326 3036.1110 3038.8986 3053.3182 3054.4463 3055.6293 3077.3873 3077.6737 3077.7947 3079.4862 3079.7279 3080.2914 3084.1570 3124.7871
redmass: 3.0660 4.2922 4.2811 4.8256 4.8889 1.8091 4.1886 3.5621 2.9203 2.0808 4.3898 3.1513 3.7989 3.3839 4.7713 4.6657 5.4814 4.6300 4.9398 4.4462 1.7358 1.8592 1.1057 1.1134 3.4210 2.9545 4.5768 3.6632 2.8893 3.7616 3.1845 3.1446 4.2205 8.9005 9.9965 3.3753 3.8624 6.1117 2.8638 4.0775 5.7243 4.9766 4.6994 3.6942 1.2462 1.2256 1.2539 2.6659 1.3550 1.3306 1.4450 2.0724 2.2103 2.1595 2.0698 2.7388 2.3957 3.0516 2.9829 2.6972 2.5511 2.4790 2.6918 1.5906 1.6744 2.0274 2.2384 2.0437 2.1467 2.1416 2.5347 1.1058 1.1646 1.3405 1.3380 1.3274 1.2205 1.2242 1.2201 1.2394 1.2103 1.2877 1.2462 1.2320 1.4368 1.5102 1.5529 1.3559 1.5541 1.2146 1.2121 1.2124 1.0898 1.0863 1.0908 1.0849 1.0746 1.0491 1.0508 1.0511 1.0420 1.0435 1.0455 1.0811 1.0786 1.0774 9.2940 9.2240 10.0061 1.0623 1.0579 1.0362 1.0366 1.0397 1.0644 1.0622 1.0614 1.0616 1.0614 1.0824 1.0647 1.0916 1.0967 1.0960 1.0998 1.1003 1.0986 1.0991 1.0991 1.0993 1.1015 1.1018 1.1019 1.1051 1.1028
irintensity: 0.0574 0.1790 0.9943 0.3855 0.8771 0.1231 0.2464 0.2335 0.1366 1.2678 0.7234 0.1914 0.9248 1.1334 1.8549 1.4614 1.1511 1.5558 0.4349 15.2611 9.2567 10.6143 0.0840 0.1999 8.2135 6.2242 4.8720 4.3746 2.8390 1.2026 4.9629 5.4057 2.7177 2.5564 3.5473 7.3057 1.0276 30.3706 3.3898 2.8485 7.4377 54.0898 60.3469 10.7255 12.2763 11.6067 29.7295 6.5297 1.6621 1.7315 8.2662 20.4644 20.9938 28.6970 12.7772 50.8448 69.9752 73.7208 136.2307 42.5665 15.7614 5.7047 0.2702 2.4328 4.3732 152.8913 60.7683 68.4451 43.9528 39.1551 256.6795 4.8003 6.8441 0.4720 0.7385 4.5294 7.7188 18.9649 24.0025 12.0273 30.6013 57.8620 4.8286 7.1132 5.5519 12.2720 12.2338 16.5816 17.6541 8.3519 8.8388 8.7987 13.4292 21.4101 11.6561 21.6842 18.1360 4.6717 6.1839 2.9945 12.9394 13.1248 12.6991 6.5589 12.6830 28.3767 133.9813 137.2869 202.0333 7.1661 11.3628 35.9125 26.6032 40.3977 5.4357 23.5924 22.8461 23.4715 15.0635 15.1796 9.6759 4.2065 2.5844 2.0188 0.2752 0.3692 1.0906 47.6208 56.3835 40.0944 62.0320 76.2467 65.0448 15.9643 0.3380
temp: 298.150 k
press: 1.00000 atm
elementType: 16 16 8 8 8 8 6 6 6 6 6 6 6 6 6 6 6 6 6 6 6 1 1 1 1 1 1 1 1 1 1 1 1 1 1 1 1 1 1 1 1 1 1 1 1 1 1
symmnumber: 1
zpe: 1015110.0 jmol-1
zpe.correction: 0.386635 hartree
zpe.thermalcorrener: 0.413144 hartree
zpe.thermalcorrenthalpy: 0.414088 hartree
zpe.thermalcorrgfe: 0.323741 hartree
zpe.sumelectzpe: -1682.556571 hartree
zpe.sumelectthermal: -1682.530062 hartree
zpe.sumelectthermalent: -1682.529118 hartree
zpe.sumelectthermalfe: -1682.619464 hartree
dipole: 1.0859 1.6545 -2.6350
dipole: 3.2954
quadrupole: -128.5565 -133.6239 -151.7754
quadrupole: 1.9539 6.5851 2.4478
quadrupole: 9.4288 4.3614 -13.7901 1.9539 6.5851 2.4478
hfenergy: -1682.9432059 hartree
pointgroup: C01 [X(C15H26O4S2)]
dipole: 0.170602 -0.6318747 -1.1191882 debye
polarizability: 223.3409872|36.4679332|249.497928|-13.6120261|7.8500072|175.2006777 unknown
InChI: InChI=1S/C15H26O4S2/c1-4-7-13(16)19-10-12(21-15(18)9-6-3)11-20-14(17)8-5-2/h12H,4-11H2,1-3H3
charge 0 multiplicity 1
47 atoms
S  1.277554 -0.440556 -0.826932
S  -2.076378 0.118706 -1.712888
O  1.532165 2.566997 0.115204
O  -0.38256 -2.293978 0.358118
O  -3.090835 0.305648 0.831639
O  2.522319 3.518906 1.995454
C  0.037811 0.644567 0.126645
C  -0.94861 1.34053 -0.826769
C  0.791274 1.634278 1.011836
C  1.337753 -3.243952 -1.119723
C  0.590984 -2.125004 -0.409166
C  1.536707 -4.495662 -0.229141
C  -4.086636 -1.486008 -0.532053
C  3.152809 4.299451 -0.273458
C  -5.424031 -1.414464 0.241068
C  3.744674 5.595116 0.320964
C  -3.167001 -0.309844 -0.253782
C  2.403016 3.466362 0.751175
C  2.192197 -5.653535 -1.009391
C  -6.265579 -2.693019 0.048539
C  4.60186 6.361115 -0.707595
H  -0.503082 -0.066957 0.779952
H  -0.434083 1.913494 -1.612543
H  -1.608377 2.00832 -0.244783
H  1.507445 1.127383 1.680867
H  0.085737 2.223025 1.628186
H  2.305992 -2.870452 -1.50166
H  0.731612 -3.520595 -2.007933
H  2.163205 -4.226321 0.642906
H  0.555499 -4.808163 0.172071
H  -3.524123 -2.392275 -0.221465
H  -4.256661 -1.582416 -1.621233
H  3.966894 3.66562 -0.681987
H  2.479272 4.511896 -1.123836
H  -5.997172 -0.530549 -0.099347
H  -5.208436 -1.254864 1.313047
H  2.921689 6.240684 0.682804
H  4.348708 5.33987 1.210819
H  2.338671 -6.534567 -0.358926
H  3.181789 -5.361336 -1.408121
H  1.563274 -5.966377 -1.864225
H  -6.503614 -2.863099 -1.018491
H  -5.72608 -3.584513 0.420072
H  -7.221194 -2.624119 0.599054
H  5.455085 5.746924 -1.05295
H  4.00879 6.643563 -1.597946
H  5.011667 7.288676 -0.268871
