program: Gaussian 09
title: 000017665
version: EM64L-G09RevD.01
frameworkgroup: C1[X(C11H16N2O)]
method: RPBEPBE
basis: SDD
operation: Freq
keyword: #p
keyword: freq=noraman
keyword: PBEPBE/SDD
title: #p freq=noraman PBEPBE/SDD
converged: YES YES NO NO
title: Mulliken charges:
elementType: O N N C C C C C C C C C C C H H H H H H H H H H H H H H H H
charge: -0.325847 -0.089314 -0.393487 -0.396817 -0.370810 0.320952 -0.614650 -0.614978 0.070223 -0.331177 -0.290288 -0.173283 -0.170948 -0.230195 0.194119 0.227788 0.242214 0.222240 0.351255 0.229388 0.192334 0.224115 0.221763 0.227524 0.193505 0.232978 0.232323 0.202114 0.205929 0.211031
chargesum: 0.00000
title: Mulliken charges with hydrogens summed into heavy atoms:
elementType: O N N C C C C C C C C C C C
charge: -0.325847 -0.089314 -0.042232 0.025089 0.093644 0.320952 0.031186 0.027814 0.070223 -0.098199 -0.057965 0.028832 0.034981 -0.019164
polarizability: 2.22801955e+02 -1.21035547e+01 1.51874422e+02 1.80477495e+00 5.17230960e+00 7.96146913e+01
1716.lowfreq: -8.8013 -5.7248 0.0002 0.0002 0.0003 7.3933 25.2002 35.8019 65.6959
frequency: 24.9099 35.6201 65.6495 89.3120 113.1752 161.7992 188.8772 202.1837 208.3915 219.3834 254.5397 338.5858 379.4511 383.2389 390.2711 411.5130 414.9626 461.5608 486.5661 547.4440 603.3378 699.8005 715.6292 734.6394 742.1409 777.3004 803.0318 830.1205 851.0522 868.2526 905.5337 962.2964 986.4349 1005.9027 1023.3362 1033.4780 1035.1830 1065.9563 1080.1819 1090.9698 1109.1443 1139.9905 1179.6414 1215.9026 1228.6927 1248.9731 1268.9382 1288.3082 1300.8949 1312.1134 1334.0283 1381.6624 1392.5977 1395.8212 1421.4001 1444.0168 1445.1578 1462.1918 1468.9370 1475.3458 1478.3991 1486.0944 1487.1767 1491.7777 1521.5931 1557.2075 1594.8315 1619.7805 2844.7902 2858.0180 2872.4142 2957.9096 3004.0134 3023.9816 3030.6387 3032.9150 3081.7045 3086.6583 3092.4427 3097.9850 3118.0553 3128.6551 3140.3931 3307.9965
redmass: 3.0175 3.4936 3.9743 3.3438 2.2535 3.8817 3.7761 2.6708 3.2782 1.1935 1.2418 2.7722 3.1253 3.3682 3.9455 3.4758 4.3042 3.0114 5.6288 4.3830 3.1013 6.3550 1.8378 6.3493 1.2984 1.4042 1.2179 3.9494 1.6142 5.3897 1.3980 3.0194 1.3367 1.3212 3.6529 2.1436 1.6719 1.7479 2.1500 1.3230 2.5774 1.4906 1.5858 1.4220 1.4194 1.5815 2.5450 1.1929 1.2064 1.4391 1.4977 1.5615 1.9357 1.6136 1.1415 1.5622 1.6311 1.0468 1.0669 1.1205 1.1466 1.1842 1.3703 1.3743 3.4943 3.8754 4.4631 7.4869 1.0690 1.0566 1.0574 1.0586 1.0971 1.0736 1.0753 1.0912 1.1011 1.1005 1.0824 1.0861 1.0891 1.0913 1.0955 1.0751
irintensity: 1.2767 0.2852 1.6815 1.2823 2.6221 0.1678 0.3643 0.0704 0.5875 1.8302 0.1139 17.2657 5.1808 0.1847 1.4950 3.7074 1.3226 2.3530 18.1122 5.1724 0.1409 0.7673 1.3583 7.5523 157.1967 21.9458 4.3405 18.6310 1.1573 7.4594 11.6234 5.8721 0.0648 2.1196 5.6084 28.6730 27.5007 2.7864 36.5975 5.9129 19.1163 1.9232 7.1783 2.6384 9.5495 4.9018 10.0268 20.5458 6.6324 0.8437 8.9199 14.8433 44.9245 7.9340 3.1707 49.6346 61.9714 8.2188 9.7556 94.1125 19.8750 83.8401 84.6781 18.4064 59.3270 313.3327 44.3844 183.6375 64.4803 66.1900 222.2626 40.2561 13.7359 39.3431 48.8733 37.7027 25.3754 59.4568 9.9419 5.9518 26.4468 32.0192 25.5392 62.4242
temp: 298.150 k
press: 1.00000 atm
elementType: 8 7 7 6 6 6 6 6 6 6 6 6 6 6 1 1 1 1 1 1 1 1 1 1 1 1 1 1 1 1
symmnumber: 1
zpe: 661661.7 jmol-1
zpe.correction: 0.252014 hartree
zpe.thermalcorrener: 0.266348 hartree
zpe.thermalcorrenthalpy: 0.267292 hartree
zpe.thermalcorrgfe: 0.209482 hartree
zpe.sumelectzpe: -612.391578 hartree
zpe.sumelectthermal: -612.377244 hartree
zpe.sumelectthermalent: -612.376299 hartree
zpe.sumelectthermalfe: -612.434110 hartree
dipole: -2.2215 -3.0228 0.1283
dipole: 3.7535
quadrupole: -67.8472 -89.2783 -88.0917
quadrupole: -7.5482 -1.9612 -1.8102
quadrupole: 13.8918 -7.5392 -6.3526 -7.5482 -1.9612 -1.8102
hfenergy: -612.6435916 hartree
pointgroup: C01 [X(C11H16N2O1)]
dipole: -0.8812383 -1.1689815 -0.1939463 debye
polarizability: 222.6624771|-12.3511363|146.5911506|-2.1137235|19.8130648|85.0374405 unknown
InChI: InChI=1S/C11H16N2O/c1-13(2)9-8-12-10-6-4-3-5-7-11(10)14/h3-7,12H,8-9H2,1-2H3
charge 0 multiplicity 1
30 atoms
O  1.249358 2.256855 0.82983
N  -4.104182 -0.282703 -0.103039
N  -0.410403 0.442186 0.179606
C  -2.871507 0.49479 0.14234
C  -1.60497 -0.350892 -0.109485
C  0.887429 0.028938 0.069838
C  -5.262988 0.573071 -0.434464
C  -4.421485 -1.235058 0.982162
C  1.820086 1.147573 0.46963
C  1.215185 -1.27703 -0.362855
C  3.258219 1.027103 0.465542
C  2.485396 -1.882516 -0.531722
C  4.094963 -0.043242 0.128549
C  3.770005 -1.354283 -0.319573
H  -2.83288 0.916592 1.180658
H  -2.859817 1.353753 -0.555001
H  -1.611321 -0.689932 -1.16469
H  -1.615581 -1.261071 0.525227
H  -0.472616 1.423205 0.512783
H  -5.023328 1.207183 -1.306056
H  -5.580183 1.240608 0.406034
H  -6.124528 -0.063562 -0.704253
H  -3.579331 -1.927707 1.15116
H  -5.298478 -1.841212 0.694223
H  -4.652458 -0.728805 1.95382
H  0.36115 -1.922239 -0.606398
H  3.746296 1.955733 0.79038
H  2.451812 -2.923571 -0.883375
H  5.170239 0.164199 0.226244
H  4.615519 -2.023766 -0.521815
