program: Gaussian 09
title: 000194056
version: EM64L-G09RevD.01
frameworkgroup: C1[X(C17H9NO9S4)]
method: RPBEPBE
basis: SDD
operation: Freq
keyword: #p
keyword: freq=noraman
keyword: PBEPBE/SDD
title: #p freq=noraman PBEPBE/SDD
converged: YES YES NO NO
title: Mulliken charges:
elementType: S S S S O O O O O O O O O N C C C C C C C C C C C C C C C C C H H H H H H H H H
charge: 0.975725 0.974948 0.970191 0.207783 -0.556398 -0.557898 -0.555554 -0.480376 -0.482522 -0.479914 -0.483719 -0.488123 -0.480900 0.308995 0.039249 0.124909 0.705121 0.699919 0.696606 0.253123 -0.416346 -0.417116 -0.378689 -0.478454 -0.449388 -0.471680 -0.357848 -0.464130 0.317835 -0.521171 -0.744676 0.293798 0.295418 0.293290 0.347640 0.269180 0.321210 0.390119 0.389599 0.390245
chargesum: 0.00000
title: Mulliken charges with hydrogens summed into heavy atoms:
elementType: S S S S O O O O O O O O O N C C C C C C C C C C C C C C C C C
charge: 0.975725 0.974948 0.970191 0.207783 -0.166279 -0.168300 -0.165308 -0.480376 -0.482522 -0.479914 -0.483719 -0.488123 -0.480900 0.308995 0.039249 0.124909 0.705121 0.699919 0.696606 0.253123 -0.416346 -0.417116 -0.378689 -0.184656 -0.153970 -0.178391 -0.010208 -0.194949 0.317835 -0.199961 -0.744676
polarizability: 6.04089787e+02 -7.31161093e+01 4.46608160e+02 2.88493811e+00 -1.75095929e+00 1.64974180e+02
1716.lowfreq: -2.2169 -0.0018 -0.0013 0.0006 2.4649 4.4565 18.8596 20.3279 32.8759
frequency: 18.8546 20.3228 32.8706 35.5745 37.0884 37.9936 63.0226 73.6282 87.7137 101.8453 111.8259 128.2423 138.1297 155.3791 173.3717 176.2078 181.0038 187.6101 202.0420 205.4057 216.2924 224.3523 232.2493 241.8704 260.0061 264.1156 276.9379 279.9773 286.9336 302.7899 314.5830 315.1813 326.6330 330.6740 331.7489 347.3555 400.4275 404.7014 405.4152 412.8306 418.2518 438.4099 439.9949 506.2592 508.0354 521.5520 528.0830 537.8111 553.0924 560.3374 567.7765 576.6015 627.9099 631.3208 642.9929 658.2201 662.1195 682.5228 754.1952 772.9887 775.9288 801.1864 810.9812 831.9887 834.3313 842.2216 872.5596 898.7487 938.2982 941.1620 945.4206 964.8595 965.0752 968.3166 974.3790 984.3864 997.4653 1008.4428 1045.0657 1046.3409 1047.3327 1114.3414 1130.4411 1180.1139 1191.6776 1200.6943 1225.0579 1231.5956 1292.6411 1330.1866 1366.5832 1372.8023 1392.9908 1401.3594 1410.7127 1432.8451 1455.2162 1482.7319 1496.2195 1524.3234 1568.7415 1589.4097 1609.1320 1626.1169 2159.3113 3126.8149 3159.1845 3161.0078 3169.1943 3182.6270 3186.6239 3475.8955 3477.5502 3478.7595
redmass: 20.9909 15.1419 10.6657 11.0938 10.0220 10.6168 6.2518 8.0288 13.1002 11.2723 6.6491 9.7457 9.9759 6.8285 3.8385 2.9580 2.4991 5.4213 6.2871 7.0221 3.0759 2.6262 3.7129 2.5789 5.1338 3.2956 4.7162 4.4939 5.3713 5.3691 6.5823 9.3870 10.3251 9.8664 10.6133 8.8080 11.5893 9.4155 9.8736 9.9642 11.6725 9.4368 9.2633 4.1319 5.8940 8.6444 8.1511 10.8176 6.7205 8.0008 9.8547 7.4725 7.5618 5.3841 6.1306 4.3334 8.6754 7.0328 5.0973 5.3988 1.7448 5.3097 10.4710 10.9467 13.0955 11.4406 1.7721 2.0355 1.7927 4.6292 1.7837 15.0824 10.4545 13.8769 2.9863 3.6862 1.6711 1.9309 1.1669 1.1664 1.1683 4.6549 3.1305 1.7974 1.7959 1.8337 1.6911 2.3557 3.2526 2.3209 3.4274 2.3941 4.9996 8.2022 2.8849 5.5975 4.0667 4.9568 3.7622 8.1501 7.5113 9.1035 6.3355 6.7017 12.8901 1.0922 1.0927 1.0885 1.0890 1.0976 1.0980 1.0662 1.0662 1.0662
irintensity: 0.2958 0.0110 0.9269 0.1587 1.2821 0.5365 0.3870 0.7214 0.1996 0.2839 0.6438 0.9240 0.6848 3.7651 31.1284 16.8231 23.3360 16.6483 6.0716 0.5569 39.3200 7.8218 20.0465 8.3529 28.7818 49.4095 23.2386 39.9472 57.2837 28.1550 10.9487 9.2358 22.5531 7.8280 10.7762 0.2677 77.4816 84.6112 32.3066 91.4974 46.6456 3.3846 40.2906 9.7118 30.3586 118.7949 9.4345 67.8017 70.9405 139.7436 33.3403 31.4347 15.2675 4.7581 40.7194 12.6139 22.7269 2.8785 0.5171 43.9733 7.8173 24.0497 28.5400 118.9742 110.5932 40.6110 16.5011 61.4001 12.4507 2.2765 30.5369 100.9619 52.6423 48.7492 21.2856 20.2819 1.7499 1.2048 107.7725 92.9507 82.2601 27.4309 3.2977 23.0638 26.6084 13.0165 12.5787 15.4055 24.8216 16.3311 8.0329 4.5860 2.9689 24.4870 21.7177 16.0779 14.0439 10.6387 84.8806 62.7661 62.6477 14.1746 54.4750 94.9010 2256.6682 51.1428 15.9447 7.0259 9.3612 2.7372 1.7314 60.5559 63.7166 59.6186
temp: 298.150 k
press: 1.00000 atm
elementType: 16 16 16 16 8 8 8 8 8 8 8 8 8 7 6 6 6 6 6 6 6 6 6 6 6 6 6 6 6 6 6 1 1 1 1 1 1 1 1 1
symmnumber: 1
zpe: 613858.2 jmol-1
zpe.correction: 0.233806 hartree
zpe.thermalcorrener: 0.264344 hartree
zpe.thermalcorrenthalpy: 0.265288 hartree
zpe.thermalcorrgfe: 0.170216 hartree
zpe.sumelectzpe: -2974.538749 hartree
zpe.sumelectthermal: -2974.508212 hartree
zpe.sumelectthermalent: -2974.507267 hartree
zpe.sumelectthermalfe: -2974.602340 hartree
dipole: -2.5054 0.9231 1.3240
dipole: 2.9803
quadrupole: -246.7124 -204.2853 -213.2488
quadrupole: -4.4152 -7.8355 8.7813
quadrupole: -25.2969 17.1302 8.1667 -4.4152 -7.8355 8.7813
hfenergy: -2974.7725552 hartree
pointgroup: C01 [X(C17H9N1O9S4)]
dipole: 0.9205474 0.4790029 -0.5458959 debye
polarizability: 581.1072877|91.7754708|469.3763319|-4.6700717|-8.317184|165.1885082 unknown
InChI: InChI=1S/C17H9NO9S4/c19-29(20,21)13-5-12(18-7-28)8-1-2-10-14(30(22,23)24)6-15(31(25,26)27)11-4-3-9(13)16(8)17(10)11/h1-6,19,22,25H
charge 0 multiplicity 1
40 atoms
S  -3.560176 -2.990576 0.040074
S  -4.063004 2.476716 -0.03447
S  4.262657 -2.245068 0.024867
S  5.071109 5.147262 -0.149133
O  -3.123123 -3.376537 1.800806
O  -3.698262 2.952998 -1.791321
O  3.886489 -2.791895 -1.706522
O  -5.140075 -2.684325 -0.089925
O  -2.876115 -4.112784 -0.904102
O  -5.562314 1.890097 0.085309
O  -3.595282 3.697419 0.919715
O  5.757902 -1.637806 0.103381
O  3.822988 -3.428789 1.035912
N  3.417911 2.848139 -0.082758
C  -0.622801 0.03694 -0.003514
C  0.810796 0.169154 -0.007604
C  -1.220884 -1.284041 0.017449
C  -1.452758 1.225807 -0.021073
C  1.638124 -1.018827 0.010755
C  1.404843 1.480816 -0.03916
C  -2.638709 -1.345504 0.017315
C  -2.858145 1.028021 -0.016017
C  3.041137 -0.802901 -0.002112
C  -0.364074 -2.444209 0.038123
C  -0.823502 2.524811 -0.044923
C  1.01167 -2.315738 0.039122
C  -3.474502 -0.225871 0.001499
C  0.553162 2.639898 -0.05605
C  2.834123 1.607928 -0.051522
C  3.65274 0.449208 -0.039419
C  4.145721 3.817786 -0.110624
H  -0.814433 -3.439228 0.042578
H  -1.447389 3.421391 -0.043807
H  1.637277 -3.210937 0.067713
H  -4.567145 -0.327243 0.003147
H  1.017147 3.630306 -0.076246
H  4.743898 0.533905 -0.052709
H  -3.544502 -4.2533 2.04039
H  -4.297554 3.718018 -2.034687
H  4.44645 -3.598745 -1.904658
