program: Gaussian 09
title: 000194038
version: EM64L-G09RevD.01
frameworkgroup: C1[X(C6H3Cl3S)]
method: RPBEPBE
basis: SDD
operation: Freq
keyword: #p
keyword: freq=noraman
keyword: PBEPBE/SDD
title: #p freq=noraman PBEPBE/SDD
converged: NO NO NO NO
title: Mulliken charges:
elementType: Cl Cl Cl S C C C C C C H H H
charge: 0.028970 0.004120 -0.032770 0.069241 -0.117842 -0.100631 -0.187130 -0.018211 -0.235253 -0.075143 0.260420 0.288082 0.116147
chargesum: 0.00000
title: Mulliken charges with hydrogens summed into heavy atoms:
elementType: Cl Cl Cl S C C C C C C
charge: 0.028970 0.004120 -0.032770 0.185388 -0.117842 -0.100631 0.073290 -0.018211 0.052829 -0.075143
polarizability: 1.51416088e+02 1.01493777e+00 1.37563346e+02 4.12192954e-02 -3.49104034e-02 3.78646969e+01
1716.lowfreq: -0.0020 0.0011 0.0020 4.3122 7.0169 8.8893 73.6869 130.7715 175.1605
frequency: 73.6860 130.7707 175.1602 185.1419 191.2707 199.2093 256.9400 298.9951 310.1536 349.9279 412.4446 486.1261 509.6488 540.5186 547.8809 689.3993 755.8039 777.8235 838.2958 847.1453 910.7513 999.4514 1105.7502 1152.3530 1192.3351 1359.7282 1362.2995 1399.5574 1553.4004 1565.4780 2429.1905 3162.5511 3186.7224
redmass: 22.5566 13.2444 18.2069 17.2938 4.6549 27.7820 1.0574 8.3978 27.1379 25.7501 8.0964 6.2961 4.9881 4.8140 8.9308 4.9107 10.8016 10.8006 1.4355 1.4046 1.1155 8.2330 1.8346 4.7599 1.5528 4.1658 5.4063 3.0378 7.4358 9.1726 1.0378 1.0927 1.0938
irintensity: 0.3314 0.0007 0.9344 0.7155 0.0120 0.2605 26.0120 1.7537 0.2208 0.4568 2.2077 4.0711 0.5122 7.7136 33.5911 7.0299 68.2241 28.3481 26.3945 19.6867 6.3627 36.4916 31.7289 7.7001 18.1519 27.5649 28.5750 98.5246 60.6568 105.0928 20.8508 0.1640 3.0134
temp: 298.150 k
press: 1.00000 atm
elementType: 17 17 17 16 6 6 6 6 6 6 1 1 1
symmnumber: 1
zpe: 179176.1 jmol-1
zpe.correction: 0.068245 hartree
zpe.thermalcorrener: 0.078277 hartree
zpe.thermalcorrenthalpy: 0.079221 hartree
zpe.thermalcorrgfe: 0.031424 hartree
zpe.sumelectzpe: -2007.944379 hartree
zpe.sumelectthermal: -2007.934347 hartree
zpe.sumelectthermalent: -2007.933403 hartree
zpe.sumelectthermalfe: -2007.981200 hartree
dipole: 1.4419 -1.6351 0.0086
dipole: 2.1800
quadrupole: -90.9047 -76.9090 -88.6013
quadrupole: -1.3857 0.0042 -0.0359
quadrupole: -5.4330 8.5627 -3.1296 -1.3857 0.0042 -0.0359
hfenergy: -2008.0126239 hartree
pointgroup: C01 [X(C6H3Cl3S1)]
dipole: -0.5765536 0.63458 -0.0228013 debye
dipolederiv: -0.6421567 0.0179747 0.0041939 0.0276071 -0.0611715 0.0026854 0.0037095 0.0030638 0.0010535 -0.2000883 0.2594345 -0.0111916 0.2628204 -0.6042218 0.0260236 -0.0112228 0.0261198 -0.0256939 -0.8354947 -0.0166164 0.0069267 0.0107409 -0.1310981 0.0037969 0.0056363 0.0039626 -0.0519851 0.1527356 -0.3063407 0.0102232 -0.3274837 -0.3790039 0.0173484 0.0117361 0.017877 -0.1007434 0.0208916 0.362304 -0.0176728 0.3986813 0.8608738 -0.0471256 -0.0183435 -0.0458624 -0.0379416 0.8473193 0.0630512 -0.0099659 -0.1202765 -0.4975012 0.0224214 -0.0019587 0.0198503 -0.0603313 -0.4510472 -0.2819892 0.0165769 -0.1070946 -0.2982883 0.0097156 0.0078687 0.0119732 -0.1052704 0.2956335 -0.3929674 0.0164574 -0.2329138 1.0033054 -0.047394 0.0086632 -0.0462288 -0.0086062 -0.4931368 0.1309307 -0.0032468 0.0926485 -0.3409405 0.0111291 -0.0015451 0.01092 -0.0941531 1.2772625 0.0334617 -0.0120457 -0.0397847 0.3749852 -0.0196499 -0.0081294 -0.0201363 -0.035195 0.0679753 0.0195176 -0.0002931 0.036516 -0.0105138 0.0085027 -0.0010806 0.0084593 0.1677451 0.0742249 -0.0292126 0.0022987 -0.0246376 0.0543929 0.0063765 0.0021715 0.0063412 0.1795324 -0.114119 0.140452 -0.002261 0.0231766 0.0291817 0.0061699 0.0024949 0.0036604 0.1715891 unknown
polarizability: 151.3755293|1.1693456|137.3638485|-1.0102499|-4.8052647|38.1047524 unknown
InChI: InChI=1S/C6H3Cl3S/c7-3-1-4(8)6(9)5(10)2-3/h1-2,10H
charge 0 multiplicity 1
13 atoms
Cl 2.896071 -0.011116 -0.057982
Cl 1.230344 -2.814037 0.091855
Cl -3.524962 0.013276 -0.007587
S  1.368907 2.767019 -0.180601
C  0.394426 1.220404 -0.097687
C  1.090334 -0.014967 -0.043295
C  -1.021634 1.222453 -0.086731
C  0.367601 -1.226806 0.021728
C  -1.041438 -1.23839 0.034059
C  -1.709499 -0.001824 -0.021119
H  -1.581575 2.161196 -0.128878
H  -1.589094 -2.18207 0.085061
H  0.26462 3.606759 -0.202022
