program: Gaussian 09
title: 000194029
version: EM64L-G09RevD.01
frameworkgroup: C1[X(C16H16ClN3)]
method: RPBEPBE
basis: SDD
operation: Freq
keyword: #p
keyword: freq=noraman
keyword: PBEPBE/SDD
title: #p freq=noraman PBEPBE/SDD
converged: NO YES NO NO
title: Mulliken charges:
elementType: Cl N N N C C C C C C C C C C C C C C C C H H H H H H H H H H H H H H H H
charge: -0.011050 -0.242904 -0.368444 -0.019211 -0.156012 -0.169516 -0.526375 -0.006137 -0.594638 0.374322 -0.522391 -0.211302 0.545786 -0.489354 0.238307 -0.455514 -0.448264 -0.365064 -0.213573 -0.160263 0.229461 0.241806 0.244815 0.211255 0.229855 0.254414 0.211684 0.225726 0.206264 0.244082 0.248741 0.250152 0.232220 0.319143 0.232493 0.219489
chargesum: 0.00000
title: Mulliken charges with hydrogens summed into heavy atoms:
elementType: Cl N N N C C C C C C C C C C C C C C C C
charge: -0.011050 0.001178 -0.049302 -0.019211 0.073449 0.072290 -0.070305 0.223718 -0.128540 0.374322 -0.090401 -0.211302 0.545786 0.009539 0.238307 -0.223294 -0.448264 -0.132571 0.005916 -0.160263
polarizability: 2.54139830e+02 1.98620340e+01 2.20626694e+02 -5.95264321e+00 2.13615473e+00 1.08517275e+02
1716.lowfreq: -13.2074 -6.3668 -0.0012 -0.0009 0.0003 6.0210 30.8762 53.9778 80.2904
frequency: 30.6801 53.9415 80.2800 100.5877 106.3819 121.5531 148.3707 191.5763 213.4172 246.3652 277.7285 286.6770 303.0988 314.2666 340.1804 351.9347 367.8865 404.1776 411.9904 436.0348 458.4685 466.3274 499.2156 510.2828 554.2371 563.3020 597.6855 605.0821 609.3952 633.0027 654.6028 731.1286 751.8602 762.1295 785.8117 800.5577 852.9600 864.1448 884.2050 896.0417 902.9751 928.4545 956.9560 969.1435 994.2336 1019.0142 1046.4598 1060.3031 1065.9799 1093.8240 1105.1039 1108.6771 1119.4444 1134.9626 1151.6214 1176.6359 1184.1660 1187.8733 1195.2690 1237.7729 1256.2661 1261.6384 1267.4577 1283.5271 1288.6673 1301.9254 1314.2868 1315.2412 1324.8363 1328.6500 1340.3837 1355.2676 1360.3041 1397.5221 1415.0781 1439.4411 1440.2831 1447.4466 1455.5482 1460.3115 1467.4412 1500.6693 1585.1207 1612.4816 1628.7533 2193.7857 2914.4448 2945.2892 2959.3709 2961.3963 2973.8308 2976.1459 2982.1805 3032.5444 3033.4685 3041.5753 3049.5242 3127.9242 3143.8206 3160.2940 3414.6534 3614.4602
redmass: 9.1624 6.7705 4.4531 4.9525 5.0172 7.2341 3.4267 4.5423 3.1078 2.4644 5.2852 4.5535 5.6758 4.4507 3.7670 3.6286 3.2180 5.5838 2.6508 3.6260 1.2128 3.5352 4.4642 4.0698 3.7534 4.2005 4.0777 4.5976 3.8204 2.8059 2.0029 4.8159 1.6862 4.3003 3.3312 2.1793 1.9343 2.7099 1.5109 2.1235 2.3292 4.0028 1.3235 1.8561 4.1948 2.8158 2.2232 2.7530 3.0284 2.0848 3.2306 2.4139 2.5533 2.8136 1.7300 1.2503 1.5013 1.4992 1.4433 1.6686 1.5709 1.2392 1.3614 3.0265 1.1872 1.6172 1.3670 1.4098 1.3351 1.8202 1.4521 1.3035 1.5140 3.1648 3.0644 1.0943 4.4255 1.1229 1.1540 1.1445 1.0925 3.2436 9.4638 8.7234 7.8638 12.4283 1.0803 1.0697 1.0659 1.0652 1.0783 1.0736 1.0660 1.0996 1.1008 1.1007 1.0922 1.0858 1.0917 1.0984 1.0742 1.0810
irintensity: 1.5785 5.3194 4.4696 1.0523 1.6448 0.9011 1.1275 2.9584 3.6384 3.6674 1.4162 1.8496 3.5238 0.5337 3.4154 9.9740 0.6909 5.1628 2.9303 0.8016 94.5734 1.4599 6.6292 9.1738 8.7530 2.2734 11.8134 0.3518 10.5565 59.2028 62.9035 1.8911 49.7616 27.7068 16.5374 15.1628 5.0829 5.7004 4.9119 18.0975 2.2845 6.9983 1.1822 9.1040 6.4554 4.0080 4.0483 2.6591 2.7650 2.5417 20.5790 0.1844 9.8032 43.7625 4.5722 6.5457 3.4341 1.0714 3.4462 20.3553 1.3545 4.9157 2.5804 2.4325 1.6922 15.6395 15.1818 20.0632 5.6887 11.7907 0.7320 0.3754 1.7930 89.6900 10.3720 9.5577 54.9864 6.2588 26.9396 21.6719 6.3884 3.4700 31.2682 5.3987 13.4348 20.4443 11.4284 24.1579 37.4853 5.7266 3.5341 47.5730 52.8045 25.6315 1.7845 59.6475 16.5538 2.9090 17.7583 27.8744 1.0173 89.2043
temp: 298.150 k
press: 1.00000 atm
elementType: 17 7 7 7 6 6 6 6 6 6 6 6 6 6 6 6 6 6 6 6 1 1 1 1 1 1 1 1 1 1 1 1 1 1 1 1
symmnumber: 1
zpe: 755320.3 jmol-1
zpe.correction: 0.287686 hartree
zpe.thermalcorrener: 0.304581 hartree
zpe.thermalcorrenthalpy: 0.305525 hartree
zpe.thermalcorrgfe: 0.242918 hartree
zpe.sumelectzpe: -1242.180888 hartree
zpe.sumelectthermal: -1242.163993 hartree
zpe.sumelectthermalent: -1242.163049 hartree
zpe.sumelectthermalfe: -1242.225657 hartree
dipole: -2.2903 -1.5661 0.7545
dipole: 2.8753
quadrupole: -132.7517 -125.4890 -124.9135
quadrupole: -26.6878 5.3646 5.7297
quadrupole: -5.0336 2.2291 2.8046 -26.6878 5.3646 5.7297
hfenergy: -1242.4685743 hartree
pointgroup: C01 [X(C16H16Cl1N3)]
dipole: 0.8521481 0.6862512 0.287317 debye
polarizability: 250.9522192|22.2371883|223.7910891|5.5142286|-2.9900331|108.5404902 unknown
InChI: InChI=1S/C16H16ClN3/c17-16-12-7-14-11(6-9(4-5-18)8-19-14)10-2-1-3-13(20-16)15(10)12/h1-3,9,11,14,19-20H,4,6-8H2
charge 0 multiplicity 1
36 atoms
Cl 4.724184 2.277483 -0.063886
N  -1.277297 2.56204 -0.060953
N  4.001464 -0.3941 0.112696
N  -5.534065 -1.7811 -0.522696
C  -0.661038 0.12118 -0.409296
C  -0.243282 1.526916 0.174982
C  -2.050657 -0.278247 0.145819
C  -3.113393 0.812112 -0.131472
C  1.124668 2.039789 -0.359431
C  0.428878 -0.921917 -0.156623
C  -2.62041 2.180298 0.423145
C  1.747496 -0.417188 -0.0883
C  2.160961 0.961706 -0.183491
C  -4.495293 0.455385 0.491876
C  2.888922 -1.252353 0.099291
C  0.280307 -2.316678 -0.015658
C  3.539765 0.928319 -0.054698
C  2.741143 -2.651569 0.228668
C  1.4219 -3.157363 0.171721
C  -5.079268 -0.779844 -0.058268
H  -0.757864 0.255233 -1.512173
H  -0.152606 1.400603 1.27499
H  -2.378187 -1.23608 -0.300563
H  -1.968228 -0.44487 1.240757
H  -3.242081 0.909131 -1.229914
H  1.389621 2.971625 0.17113
H  1.015413 2.303876 -1.433928
H  -3.331639 2.986448 0.160399
H  -2.581349 2.123522 1.53117
H  -1.293202 2.855466 -1.049183
H  -5.211642 1.283912 0.324177
H  -4.389343 0.337319 1.588867
H  -0.711622 -2.779924 -0.052961
H  4.977279 -0.656645 0.23169
H  3.593562 -3.324245 0.369841
H  1.268204 -4.237842 0.271774
