program: Gaussian 09
title: 000194026
version: EM64L-G09RevD.01
frameworkgroup: C1[X(C17H32O2)]
method: RPBEPBE
basis: SDD
operation: Freq
keyword: #pfreq=noraman
keyword: PBEPBE/SDD
title: #p freq=noraman PBEPBE/SDD
converged: YES YES NO NO
title: Mulliken charges:
elementType: O O C C C C C C C C C C C C C C C C C H H H H H H H H H H H H H H H H H H H H H H H H H H H H H H H H
charge: -0.417970 -0.231359 -0.387180 -0.370916 -0.380898 -0.396526 -0.372420 -0.547003 -0.353522 0.436845 -0.356483 -0.440273 -0.365062 -0.362432 -0.364496 -0.834718 -0.696632 -0.488707 0.172799 0.191955 0.194616 0.194852 0.190019 0.191751 0.192189 0.212032 0.201238 0.189667 0.189075 0.195006 0.211471 0.187814 0.187570 0.194783 0.194706 0.198154 0.202398 0.217133 0.206612 0.192261 0.213302 0.218256 0.230180 0.224582 0.221286 0.209669 0.209648 0.214979 0.251847 0.252886 0.375016
chargesum: 0.00000
title: Mulliken charges with hydrogens summed into heavy atoms:
elementType: O O C C C C C C C C C C C C C C C C C
charge: -0.042954 -0.231359 -0.000609 0.013955 0.003042 0.016744 0.006321 -0.140525 0.021861 0.436845 0.033006 -0.039721 -0.147930 0.036442 0.067062 -0.158669 -0.062335 0.016026 0.172799
polarizability: 2.61500776e+02 4.52261780e+00 1.71824292e+02 3.27857574e+00 6.07590341e+00 1.55779588e+02
1716.lowfreq: -13.6489 -0.0011 -0.0006 0.0011 4.3327 5.6771 13.5096 14.9251 25.7852
frequency: 12.3623 13.6937 24.2887 29.9706 34.8718 37.1186 44.0614 61.3172 72.3350 80.6835 91.0194 104.4378 113.2703 114.7748 127.1396 134.6217 154.6513 159.9671 170.5993 194.0188 229.7042 237.9556 268.3878 289.6599 319.0565 361.9202 387.4678 422.8812 452.5475 461.9490 481.7437 500.0524 525.5152 576.3143 588.9244 637.7811 718.7894 723.1217 725.1320 735.3226 763.2016 769.3028 810.2998 814.1962 848.6013 862.3225 879.8832 888.3453 907.3748 946.1621 975.1234 987.8711 997.0699 1004.8007 1015.4093 1026.0912 1031.2255 1039.9254 1042.6156 1060.7399 1070.1782 1073.6121 1079.1246 1081.2254 1090.0265 1097.8290 1120.9994 1126.8442 1138.2088 1183.9298 1208.0400 1211.3225 1216.4343 1226.3618 1240.0784 1246.7584 1249.9360 1255.2355 1274.7031 1280.0134 1281.2841 1284.0784 1286.6651 1287.6779 1294.8488 1296.7034 1304.7779 1314.4466 1336.6147 1343.4000 1348.7999 1355.9259 1356.5518 1370.4088 1374.0521 1390.3582 1395.8113 1436.2169 1454.0391 1459.1183 1460.4406 1461.5842 1464.3469 1465.4110 1467.7460 1471.6590 1474.2562 1474.7523 1477.2724 1480.4165 1482.2392 1485.7559 1488.8556 1669.4480 1687.2921 2942.8122 2948.4379 2949.3980 2950.4145 2950.6604 2953.9848 2960.4154 2963.3435 2965.3825 2967.5381 2970.2938 2971.4951 2981.7164 2985.9948 2986.4998 2994.7284 2994.8139 3004.2624 3007.3346 3011.7590 3024.0644 3028.4410 3033.2568 3036.3073 3037.5785 3044.6298 3059.4131 3064.0026 3067.8811 3069.9520 3092.4309 3511.9960
redmass: 6.1286 5.4604 2.8386 2.8337 2.0454 2.4566 3.2161 3.1222 1.8999 2.7597 2.1896 2.2038 2.0545 1.9005 1.9094 1.9619 1.9220 2.1558 4.7097 3.1502 1.1206 3.9855 3.3281 3.2253 3.2097 3.2018 2.8116 2.9248 2.9767 3.4241 3.0399 1.7828 2.7217 2.5705 4.4363 1.3177 1.0600 1.0738 1.1181 1.1040 1.1663 1.5108 1.8641 1.4720 2.0623 2.1688 1.2898 1.8977 1.4725 1.2488 2.2557 3.6644 2.2501 2.1688 1.7160 2.4063 1.8876 2.7592 2.0280 2.3531 2.6461 2.3716 2.1267 2.2699 2.2335 1.8824 2.6131 1.3237 1.8727 1.8022 1.2913 1.6580 1.4486 1.4176 1.4035 1.3414 1.3106 1.5271 1.1490 1.0724 1.2930 1.1761 1.0769 1.0638 1.1244 1.1024 1.5263 1.3943 1.4628 1.5717 1.5553 1.6880 1.6253 1.6524 1.4802 1.2181 1.3102 1.0849 1.0781 1.0841 1.0741 1.0749 1.0670 1.0790 1.0807 1.0620 1.0796 1.0691 1.0424 1.0848 1.0967 1.0908 1.0931 8.2240 6.8583 1.0625 1.0587 1.0588 1.0628 1.0612 1.0593 1.0589 1.0604 1.0410 1.0583 1.0576 1.0366 1.0963 1.0612 1.0979 1.0602 1.0997 1.0994 1.0951 1.1015 1.1042 1.0966 1.0968 1.1042 1.0979 1.1042 1.0946 1.0985 1.1006 1.0993 1.0954 1.0639
irintensity: 1.2779 0.1665 0.0425 0.0071 0.0062 0.0761 0.1286 0.3233 0.0147 0.4368 0.1246 0.1900 0.0858 0.2206 0.6142 0.0904 0.0145 0.3019 0.6065 0.4240 0.0009 0.6721 1.6860 0.1376 0.3301 2.2141 4.1162 2.9269 4.9457 12.4627 11.2463 28.8167 7.3372 7.1239 12.5942 127.3394 15.4465 0.1094 14.9203 4.3929 0.2833 1.5936 2.3057 0.4356 15.1775 7.2738 1.4933 4.3130 4.4296 0.6759 5.5815 9.6940 5.7116 65.6479 83.0346 20.9162 12.4869 7.1205 25.0507 2.1666 10.5183 48.7206 0.0160 0.4577 19.7377 9.2478 12.6051 9.3236 9.9586 0.3614 18.0825 2.0193 2.6539 9.1971 3.8494 1.0805 0.4914 13.4680 0.0731 0.0906 0.8250 2.5948 0.4452 0.2796 0.0156 0.1814 29.0801 0.8503 0.4935 18.9497 0.2251 0.4135 0.8806 15.1933 16.2216 11.2546 22.3367 29.5426 1.2737 1.2125 0.0856 0.5723 0.0727 0.9933 0.3179 7.2558 3.6129 6.9077 12.2973 1.9387 26.2457 4.0828 32.1188 210.9791 3.5053 25.4885 3.3440 0.4825 18.1048 13.4456 0.4522 40.0789 33.0445 29.8204 87.9816 143.5487 37.0481 0.1567 5.6098 0.1588 34.8214 0.5047 3.3775 9.0788 2.3642 2.1789 2.3707 24.6255 40.1464 10.6576 203.3608 12.7146 112.2677 98.1017 55.5574 42.6806 17.7797
temp: 298.150 k
press: 1.00000 atm
elementType: 8 8 6 6 6 6 6 6 6 6 6 6 6 6 6 6 6 6 6 1 1 1 1 1 1 1 1 1 1 1 1 1 1 1 1 1 1 1 1 1 1 1 1 1 1 1 1 1 1 1 1
symmnumber: 1
zpe: 1193725.6 jmol-1
zpe.correction: 0.454666 hartree
zpe.thermalcorrener: 0.479742 hartree
zpe.thermalcorrenthalpy: 0.480686 hartree
zpe.thermalcorrgfe: 0.392893 hartree
zpe.sumelectzpe: -815.895698 hartree
zpe.sumelectthermal: -815.870623 hartree
zpe.sumelectthermalent: -815.869679 hartree
zpe.sumelectthermalfe: -815.957471 hartree
dipole: 1.3501 -0.9462 -0.1679
dipole: 1.6572
quadrupole: -133.4113 -120.2966 -119.1843
quadrupole: 11.8388 3.8820 0.8304
quadrupole: -9.1139 4.0008 5.1131 11.8388 3.8820 0.8304
hfenergy: -816.3503644 hartree
pointgroup: C01 [X(C17H32O2)]
dipole: 0.529764 0.3718124 0.0788412 debye
polarizability: 261.5417745|-4.1116874|171.3882791|-3.2678343|6.5591468|156.1746023 unknown
InChI: InChI=1S/C17H32O2/c1-3-4-5-6-7-8-10-13-16(2)14-11-9-12-15-17(18)19/h14,18H,3-13,15H2,1-2H3
charge 0 multiplicity 1
51 atoms
O  -8.076018 2.866672 0.052234
O  -8.340875 0.632648 -0.518859
C  3.884151 -0.098995 -0.288709
C  2.867867 -0.995501 0.45374
C  5.281335 -0.080567 0.371586
C  1.47077 -1.012389 -0.206264
C  6.301905 0.804586 -0.378959
C  0.471674 -1.940772 0.537154
C  7.699181 0.824817 0.280855
C  -0.934176 -1.961732 -0.05854
C  8.720933 1.704464 -0.475537
C  -3.457082 -1.442185 0.27471
C  -1.997037 -1.514706 0.672952
C  -4.038572 -0.007211 0.39837
C  -5.545485 0.047655 0.066901
C  -1.035817 -2.513563 -1.471095
C  10.114074 1.719866 0.190163
C  -6.119013 1.470525 0.206284
C  -7.594874 1.556791 -0.128649
H  3.980567 -0.447469 -1.338544
H  3.489509 0.937351 -0.341322
H  2.773032 -0.650714 1.504896
H  3.261843 -2.032732 0.502491
H  5.671634 -1.118316 0.431559
H  5.187218 0.275931 1.418865
H  1.057961 0.016542 -0.232426
H  1.574765 -1.338359 -1.260798
H  5.911095 1.842045 -0.44106
H  6.396785 0.446199 -1.425636
H  0.891217 -2.970605 0.530587
H  0.418264 -1.626289 1.598202
H  7.607344 1.188522 1.325921
H  8.089541 -0.21257 0.347209
H  8.329749 2.740373 -0.542382
H  8.812271 1.339642 -1.519197
H  -4.051787 -2.111312 0.933668
H  -3.612317 -1.805998 -0.75814
H  -1.786486 -1.147224 1.691491
H  -3.476334 0.670496 -0.27555
H  -3.868812 0.365005 1.430253
H  -6.101514 -0.640227 0.732933
H  -5.719103 -0.318978 -0.962956
H  -0.501393 -1.866266 -2.19359
H  -2.076312 -2.614724 -1.819236
H  -0.559906 -3.512503 -1.530048
H  10.054613 2.10883 1.224378
H  10.539907 0.699793 0.240922
H  10.825107 2.355335 -0.36944
H  -5.981463 1.858599 1.234604
H  -5.581947 2.182038 -0.452065
H  -9.044488 2.890883 -0.178827
