program: Gaussian 09
title: 000194024
version: EM64L-G09RevD.01
frameworkgroup: C1[X(C6H10O6)]
method: RPBEPBE
basis: SDD
operation: Freq
keyword: #pfreq=noraman
keyword: PBEPBE/SDD
title: #p freq=noraman PBEPBE/SDD
converged: YES YES NO NO
title: Mulliken charges:
elementType: O O O O O O C C C C C C H H H H H H H H H H
charge: -0.455484 -0.467819 -0.468815 -0.195031 -0.406741 -0.176156 -0.118078 -0.102056 -0.524553 -0.376177 0.171903 0.122707 0.242544 0.218112 0.261166 0.302267 0.231956 0.244641 0.362013 0.373522 0.363613 0.396466
chargesum: 0.00000
title: Mulliken charges with hydrogens summed into heavy atoms:
elementType: O O O O O O C C C C C C
charge: -0.093472 -0.094298 -0.105202 -0.195031 -0.010276 -0.176156 0.124466 0.116057 0.038880 0.100420 0.171903 0.122707
polarizability: 1.13088033e+02 -4.29972617e+00 8.45181297e+01 3.16213430e+00 3.18139354e+00 6.22488422e+01
1716.lowfreq: -15.3815 -3.8970 0.0003 0.0007 0.0009 10.5224 15.1852 29.1970 47.2794
frequency: 14.5449 28.4475 47.2370 100.5499 140.8883 170.6857 203.0632 237.2277 266.7060 294.2766 321.3346 327.6069 361.4205 393.7234 408.8693 475.4258 511.5026 546.8071 564.4513 614.3234 634.6087 682.8694 699.2321 772.3284 822.8422 912.7661 940.6940 955.8335 1000.9121 1016.5528 1031.6218 1040.3055 1081.1372 1111.6469 1144.6800 1170.7982 1260.3593 1273.4994 1281.6441 1294.1734 1312.7214 1318.6034 1345.9239 1357.3581 1407.9252 1417.7503 1441.1075 1469.1625 1606.5355 1657.3635 2939.5276 2983.7616 3009.6418 3024.5908 3057.7002 3100.7364 3290.4389 3386.1028 3507.0376 3591.0357
redmass: 10.6856 5.3320 7.4927 3.8971 5.9064 4.8835 3.8652 6.9277 2.1061 1.3935 3.6349 6.3212 3.2979 6.1471 5.3487 4.9285 4.8231 2.0901 1.2375 2.2103 2.1470 2.7074 1.1445 4.1302 4.1113 2.6527 3.1837 2.5881 5.1308 3.4389 3.4129 2.1757 2.6259 1.5415 1.8141 1.3242 1.2594 1.1613 1.4174 1.4106 1.5026 1.2733 1.2614 1.3595 1.1119 1.5063 1.1730 1.0849 9.2110 10.5075 1.0840 1.0675 1.0843 1.0617 1.0908 1.1054 1.0677 1.0679 1.0644 1.0665
irintensity: 1.3240 1.5856 5.7291 20.1849 1.9217 9.3228 3.0581 25.1404 77.1569 87.3163 32.6142 17.4334 3.0018 27.6347 9.4411 27.5707 16.5112 6.4001 173.7694 89.0806 94.7848 69.0819 106.7201 2.4378 11.4051 49.7212 31.3350 13.3292 132.0252 10.9067 220.6575 29.3670 19.2204 21.2308 9.4716 14.0249 55.7590 6.1822 13.5725 2.4035 82.8742 18.2868 3.2403 53.2438 53.9898 7.8048 92.5569 17.3760 103.9110 155.8770 71.5118 7.9084 34.8203 23.9582 6.5740 30.6694 295.4146 192.0584 34.5953 17.0701
temp: 298.150 k
press: 1.00000 atm
elementType: 8 8 8 8 8 8 6 6 6 6 6 6 1 1 1 1 1 1 1 1 1 1
symmnumber: 1
zpe: 432944.2 jmol-1
zpe.correction: 0.164900 hartree
zpe.thermalcorrener: 0.178068 hartree
zpe.thermalcorrenthalpy: 0.179012 hartree
zpe.thermalcorrgfe: 0.123128 hartree
zpe.sumelectzpe: -684.987327 hartree
zpe.sumelectthermal: -684.974159 hartree
zpe.sumelectthermalent: -684.973215 hartree
zpe.sumelectthermalfe: -685.029098 hartree
dipole: 1.4121 -2.3190 -1.4884
dipole: 3.0964
quadrupole: -59.9705 -79.6330 -72.1038
quadrupole: 13.9730 3.6595 4.3057
quadrupole: 10.5986 -9.0639 -1.5347 13.9730 3.6595 4.3057
hfenergy: -685.1522264 hartree
pointgroup: C01 [X(C6H10O6)]
dipole: 0.5183508 -0.176049 -1.0882791 debye
dipolederiv: -0.8279448 0.178327 0.0081302 0.2537982 -0.652355 -0.1346245 0.0649869 -0.1648279 -0.5372799 -0.692465 0.1353369 -0.067462 0.145855 -0.5727683 -0.1488619 0.0267377 -0.1882487 -0.6085208 -0.662623 0.0464495 0.3370977 -0.0393805 -0.6379315 -0.0596 0.4036899 -0.0714434 -0.4484623 -0.608486 0.0121596 -0.0960292 0.0454379 -0.3499198 -0.1249618 0.0254299 -0.2368413 -0.7299302 -0.3571138 -0.0574277 -0.1261822 -0.0197209 -0.4377522 -0.1696222 -0.0922035 -0.1906503 -1.1303718 -0.8187975 0.236011 0.250424 0.194457 -0.4021299 -0.169118 -0.0552137 -0.0670977 -0.5903847 0.6228984 -0.2463647 -0.0513591 -0.2582995 0.3810406 0.0254869 0.0794399 0.0221279 0.3171379 0.3776853 -0.150827 0.0025996 -0.1371335 0.3234937 0.038034 -0.0230202 0.0696154 0.3169412 -0.5064205 0.2363196 0.1211405 0.223039 -0.1197344 -0.1071654 0.0729974 -0.1052283 -0.25374 0.3724258 -0.1645634 -0.122654 -0.1755485 0.4269163 0.1219118 -0.1047584 0.078079 0.2611721 0.8241992 -0.1951169 -0.0905255 -0.2318313 0.3330226 0.2098611 -0.1829565 0.3417949 0.7588984 0.8603094 -0.2138839 -0.1204987 -0.2845672 0.4499334 0.3654017 0.1118348 0.2562948 1.3302496 -0.0534206 -0.0108255 0.0720841 -0.0275548 0.0262611 0.0358381 0.0609807 0.0509599 -0.0850784 -0.1320168 0.099855 -0.0715371 0.0951204 -0.0719283 0.0642302 -0.0841947 0.0735336 -0.0540026 0.1806678 -0.0449385 0.061441 -0.003339 0.0283908 0.0774057 0.0350533 0.055302 0.0686301 0.0234905 -0.0198733 -0.0249675 -0.0506127 0.072538 -0.0497511 -0.1000507 -0.000665 0.1222524 0.0139295 0.1045248 -0.0768913 0.090469 0.0305019 0.0205869 -0.0727913 0.0548027 -0.0325424 -0.0746513 -0.0873785 -0.0068822 -0.0739761 -0.0371279 -0.0478261 -0.0265859 -0.0794369 0.0648879 0.563929 0.0430568 -0.0221506 0.1092638 0.3168639 0.0171841 -0.0594173 0.0545014 0.3109048 0.5287414 -0.0112911 0.182758 0.0046545 0.2463892 0.0643257 0.1175126 0.0629829 0.3489141 0.2555521 0.0312463 -0.1302446 0.0451391 0.275854 -0.0179782 -0.2120979 0.005973 0.218672 0.1101109 0.0792039 -0.0282912 0.0947301 0.3704417 -0.0107571 0.0146269 -0.0215278 0.3516526 unknown
polarizability: 109.5627532|-13.1356772|70.6233758|-0.0833715|10.0114435|79.6688759 unknown
InChI: InChI=1S/C6H10O6/c7-2-5(10)3(8)1-4(9)6(11)12/h3,5,7-8,10-11H,1-2H2
charge 0 multiplicity 1
22 atoms
O  1.427104 -1.980447 -0.153544
O  1.654852 1.383031 1.586018
O  3.5645 -0.508854 -0.989335
O  -1.08876 0.921174 1.751333
O  -2.701701 0.375103 -1.390156
O  -3.650077 1.253076 0.550958
C  0.930025 -0.800968 0.55633
C  2.104002 0.151551 0.938931
C  -0.210766 -0.139937 -0.271367
C  2.93657 0.630435 -0.269923
C  -1.269839 0.538721 0.564509
C  -2.674582 0.768786 -0.048717
H  0.488923 -1.188809 1.495063
H  2.765608 -0.423453 1.62503
H  0.183226 0.601713 -0.997466
H  -0.682086 -0.923603 -0.89172
H  2.30308 1.130186 -1.020036
H  3.696883 1.353096 0.077961
H  2.204882 -1.692919 -0.722183
H  0.763706 1.23781 2.01543
H  4.390828 -0.787146 -0.522727
H  -3.60488 0.540056 -1.776788
