program: Gaussian 09
title: 000194018
version: EM64L-G09RevD.01
frameworkgroup: C1[X(C12H14O4)]
method: RPBEPBE
basis: SDD
operation: Freq
keyword: #pfreq=noraman
keyword: PBEPBE/SDD
title: #p freq=noraman PBEPBE/SDD
converged: YES YES NO NO
title: Mulliken charges:
elementType: O O O O C C C C C C C C C C C C H H H H H H H H H H H H H H
charge: -0.441653 -0.408221 -0.326197 -0.398130 -0.254877 -0.428884 0.411859 -0.057632 -0.538024 0.157335 0.044176 0.185363 -0.603078 0.142934 -0.537575 -0.669592 0.249128 0.218683 0.238082 0.262515 0.248514 0.272481 0.279840 0.185522 0.339846 0.208273 0.224600 0.246409 0.383370 0.364935
chargesum: 0.00000
title: Mulliken charges with hydrogens summed into heavy atoms:
elementType: O O O O C C C C C C C C C C C C
charge: -0.101807 -0.024851 -0.326197 -0.033195 -0.005749 0.027880 0.411859 -0.057632 -0.026995 0.157335 0.044176 0.185363 -0.330597 0.142934 -0.072213 0.009690
polarizability: 1.98427242e+02 1.04358395e+01 1.58918537e+02 2.95390003e+00 3.89467018e+00 8.73923225e+01
1716.lowfreq: -7.6938 0.0003 0.0007 0.0008 6.1904 11.6269 40.2304 61.3680 67.5558
frequency: 40.1341 61.3530 67.5386 119.7464 138.6784 147.2767 193.7365 197.3543 205.3911 252.2028 269.2865 289.9555 322.7522 353.0712 362.3270 381.6571 409.6198 432.7604 481.9278 486.4600 520.6007 544.2973 572.6849 591.2102 631.6634 646.5771 688.8099 713.3955 761.5554 775.7211 792.8538 841.4573 867.9576 888.9187 928.3089 967.9290 995.6669 998.8204 1008.1050 1033.9434 1062.3470 1101.3731 1113.7895 1129.0669 1142.1591 1164.1022 1192.0044 1211.1698 1221.6816 1253.9508 1283.0970 1302.6066 1321.5668 1327.1330 1338.7885 1357.6535 1368.3104 1380.8085 1393.0476 1422.3293 1432.8144 1442.3442 1454.0657 1459.2191 1471.9859 1482.5025 1491.0292 1572.6182 1582.0479 1638.1334 2599.7143 2946.3501 2978.6030 2982.2039 3000.1628 3054.9332 3059.1086 3068.9187 3072.6282 3079.6067 3094.0331 3168.6906 3556.6441 3561.6520
redmass: 2.6675 5.0940 3.9176 6.5040 2.7323 2.2354 1.4708 1.6290 2.3934 3.6261 4.3955 4.9184 2.8136 3.0243 4.7113 5.1710 1.4555 2.8239 3.6209 4.9620 5.6911 3.8054 6.1599 4.5044 3.7499 3.9266 6.5571 3.2603 1.5836 4.9074 2.0752 3.8463 1.5590 2.3835 2.7037 2.3775 1.0682 3.4066 2.3029 2.2340 2.0117 1.9114 2.4852 2.2473 1.4523 1.3067 1.4795 1.3857 1.5377 1.2709 2.6032 1.5020 1.5765 1.8656 2.1212 1.2207 2.0538 3.2268 1.2043 4.2433 3.0494 1.1900 1.3267 2.4691 1.0469 1.0734 1.1124 3.3878 7.1970 3.8153 1.0760 1.0706 1.0672 1.0364 1.0630 1.0871 1.0922 1.0926 1.1003 1.0973 1.1002 1.0925 1.0666 1.0651
irintensity: 0.0731 2.9823 1.4234 8.3053 14.0803 56.3739 11.5765 3.0536 11.7210 3.5442 2.1864 19.3694 4.8129 0.8975 7.9507 3.3781 94.0732 26.4302 8.0656 2.2381 2.6577 30.1266 3.8079 8.0874 3.4832 3.7881 9.3760 8.9663 7.3641 2.9906 17.4545 35.7576 20.1245 23.2698 19.5816 18.5616 123.0674 0.3185 23.5730 26.3225 14.1646 11.1190 71.9957 12.9372 247.2942 10.8032 19.3569 42.6641 54.8133 30.2028 15.6294 1.7478 8.0655 3.0722 95.5566 76.3054 115.8436 208.5447 10.5729 35.4676 76.7367 8.9484 26.4962 61.2813 7.4446 3.2309 34.8748 2.1718 184.2547 265.3768 348.7873 45.7203 7.6840 35.6960 25.6827 26.8730 4.2944 21.8845 19.8060 40.1745 24.6247 0.7636 9.2774 53.3681
temp: 298.150 k
press: 1.00000 atm
elementType: 8 8 8 8 6 6 6 6 6 6 6 6 6 6 6 6 1 1 1 1 1 1 1 1 1 1 1 1 1 1
symmnumber: 1
zpe: 623976.4 jmol-1
zpe.correction: 0.237660 hartree
zpe.thermalcorrener: 0.252774 hartree
zpe.thermalcorrenthalpy: 0.253718 hartree
zpe.thermalcorrgfe: 0.195671 hartree
zpe.sumelectzpe: -765.401437 hartree
zpe.sumelectthermal: -765.386323 hartree
zpe.sumelectthermalent: -765.385379 hartree
zpe.sumelectthermalfe: -765.443426 hartree
dipole: -1.3446 -0.9208 -0.6141
dipole: 1.7415
quadrupole: -80.7646 -110.6789 -93.3741
quadrupole: 2.8660 -2.4679 3.7870
quadrupole: 14.1746 -15.7397 1.5651 2.8660 -2.4679 3.7870
hfenergy: -765.639097 hartree
pointgroup: C01 [X(C12H14O4)]
dipole: 0.5435051 -0.3527285 0.2228249 debye
polarizability: 198.9424771|-9.6764903|158.5433011|-0.2812508|-2.9162271|87.2523236 unknown
InChI: InChI=1S/C12H14O4/c1-2-6-10(15)5-7-8(13)3-4-9(14)11(7)12(6)16/h5,8,13,15-16H,2-4H2,1H3
charge 0 multiplicity 1
30 atoms
O  -2.621712 -1.881769 -1.269092
O  0.996237 2.291741 0.120224
O  -1.485307 2.675854 0.046914
O  2.598105 -2.286126 0.331736
C  -2.256256 -1.511767 0.128463
C  -3.272992 -0.51161 0.71179
C  -0.8326 -0.973266 0.191792
C  -0.606397 0.445193 0.151545
C  -3.137176 0.880443 0.057331
C  -1.710049 1.39799 0.089672
C  0.750788 0.940215 0.170363
C  1.861728 0.058432 0.236354
C  0.25527 -1.847686 0.25398
C  1.580102 -1.33026 0.27249
C  3.279664 0.602344 0.227252
C  3.905512 0.623036 -1.195199
H  -2.324369 -2.472475 0.665638
H  -3.109051 -0.429132 1.804107
H  -4.29109 -0.908551 0.554374
H  -3.78823 1.629465 0.539624
H  -3.45939 0.829186 -1.003487
H  0.113368 -2.931585 0.278332
H  3.256294 1.632321 0.620807
H  3.930352 0.024216 0.919286
H  -2.231595 -1.216025 -1.891534
H  3.934181 -0.383686 -1.652526
H  4.937749 1.016121 -1.163153
H  3.312785 1.276065 -1.85841
H  0.06198 2.764475 0.081519
H  3.4890 -1.854361 0.368706
