program: Gaussian 09
title: 000194012
version: EM64L-G09RevD.01
frameworkgroup: C1[X(C13H18N2O5)]
method: RPBEPBE
basis: SDD
operation: Freq
keyword: #p
keyword: freq=noraman
keyword: PBEPBE/SDD
title: #p freq=noraman PBEPBE/SDD
converged: YES YES NO NO
title: Mulliken charges:
elementType: O O O O O N N C C C C C C C C C C C C C H H H H H H H H H H H H H H H H H H
charge: -0.420294 -0.234294 -0.272968 -0.439533 -0.488575 -0.361036 -0.618330 -0.118250 -0.471591 -0.364074 -0.582320 -0.541832 0.558565 0.203205 -0.517780 -0.431529 0.228122 0.181958 -0.334132 0.126318 0.241717 0.259923 0.228827 0.253005 0.206844 0.277737 0.197917 0.227180 0.256900 0.260757 0.257163 0.235126 0.217925 0.372564 0.317308 0.332777 0.383015 0.371688
chargesum: 0.00000
title: Mulliken charges with hydrogens summed into heavy atoms:
elementType: O O O O O N N C C C C C C C C C C C C C
charge: -0.047730 -0.234294 -0.272968 -0.056518 -0.116887 -0.083300 0.031755 0.123467 0.017159 0.095774 -0.157223 -0.024175 0.558565 0.203205 -0.260617 -0.196404 0.228122 0.181958 -0.116208 0.126318
polarizability: 2.37456331e+02 7.30374748e+00 1.56312000e+02 -1.96719468e+01 2.32403361e+01 1.25370029e+02
1716.lowfreq: -10.3589 -2.2407 -0.0006 0.0006 0.0008 2.5384 7.4619 16.0004 21.7303
frequency: 2.0640 15.7927 21.3140 32.5234 36.7427 42.9583 61.5301 95.5647 107.4128 132.0810 156.2839 181.7533 208.4837 211.6721 253.0459 264.3311 276.8232 290.2432 297.4514 317.1803 357.8416 397.9984 423.8659 436.9156 448.1008 483.4044 494.6276 508.0118 525.7319 535.2880 568.7286 580.4574 593.9085 617.1646 638.5526 661.4899 668.0115 708.4073 713.9372 742.7825 762.5085 787.4076 792.8817 798.2934 817.9120 879.9802 898.5949 910.9632 927.9374 953.5131 992.1120 1029.7755 1033.5865 1043.5811 1056.8482 1072.9398 1087.5446 1107.0500 1141.1911 1146.8364 1152.9520 1172.6690 1179.3799 1200.4893 1235.2200 1239.8637 1254.5920 1269.1313 1272.0954 1276.0361 1282.7572 1305.0697 1317.4658 1346.9895 1349.8803 1366.3660 1379.5414 1405.8492 1447.7246 1465.6760 1469.1985 1475.2468 1480.4616 1497.5161 1503.5192 1594.2331 1610.1003 1631.5902 1639.4410 1660.7124 2880.3177 2895.3804 2977.4850 2991.3704 2998.9831 3041.3974 3053.1671 3062.2654 3078.6537 3117.4047 3144.7103 3151.4522 3434.7226 3495.2467 3517.0555 3527.2892 3624.8767 3674.3337
redmass: 5.6545 6.7843 4.8860 6.2620 7.8842 5.8461 3.6264 3.2469 3.8070 3.0085 4.1253 4.6092 3.9851 5.1159 1.3159 2.9213 4.7001 3.8651 3.1024 5.1112 3.6982 4.3573 2.6012 3.2708 3.5167 1.1140 2.2985 2.2900 1.5673 2.7001 5.4715 2.2191 1.8258 1.8933 2.0411 1.8253 3.6387 4.0039 3.7296 4.1839 4.1209 1.3976 1.6145 1.3619 3.4397 1.5241 3.0027 1.3508 2.8885 2.4707 2.7587 2.1972 2.1491 3.2132 2.0291 2.0872 2.1631 2.6842 1.2212 2.6303 1.8996 1.1642 1.4056 1.3396 1.4619 1.8096 1.5521 1.8568 1.3073 1.3729 1.4624 1.4744 1.5709 1.6925 1.5497 1.5421 1.9373 5.4862 1.1375 2.6270 1.2037 1.1000 1.1602 1.0950 3.2476 1.4731 7.0485 6.7760 3.3241 8.3172 1.0717 1.0816 1.0632 1.0643 1.0623 1.0923 1.0982 1.0947 1.0983 1.0880 1.0951 1.0932 1.0746 1.0638 1.0445 1.0648 1.0666 1.1044
irintensity: 0.8814 1.1423 0.6636 6.3770 7.3100 1.5631 0.2786 7.1021 4.0334 1.8660 0.7856 1.8875 8.7176 12.3333 127.2276 41.6976 7.2226 1.9711 4.1974 3.7439 7.5518 1.2937 4.0031 22.1454 11.5528 124.0022 34.6256 64.3363 132.6968 46.4989 1.4390 93.0479 20.7348 58.0509 42.0257 65.0768 24.7794 39.6665 19.9769 5.3593 30.6957 35.8590 10.4923 9.5426 1.8898 16.5274 11.5666 0.5533 22.5036 10.9064 18.4702 88.2247 46.8822 91.7031 9.6680 192.0449 16.8539 90.2088 7.6224 54.5805 57.7576 13.4539 67.7026 0.9114 16.2482 54.1686 15.4349 131.4321 20.5856 13.0476 74.3140 8.2751 29.5468 58.6133 68.3522 50.6613 50.1149 4.3877 5.5636 8.3444 34.4548 8.7983 1.3182 13.0458 131.9988 64.9204 43.6048 1.4052 267.9417 245.2158 76.2721 54.1177 35.2893 2.4148 29.1157 9.6955 9.0958 23.3063 20.8887 16.9714 16.2129 1.1439 0.4520 15.4892 32.2107 82.4305 56.7718 23.0488
temp: 298.150 k
press: 1.00000 atm
elementType: 8 8 8 8 8 7 7 6 6 6 6 6 6 6 6 6 6 6 6 6 1 1 1 1 1 1 1 1 1 1 1 1 1 1 1 1 1 1
symmnumber: 1
zpe: 792524.9 jmol-1
zpe.correction: 0.301857 hartree
zpe.thermalcorrener: 0.323113 hartree
zpe.thermalcorrenthalpy: 0.324057 hartree
zpe.thermalcorrgfe: 0.245198 hartree
zpe.sumelectzpe: -990.293433 hartree
zpe.sumelectthermal: -990.272176 hartree
zpe.sumelectthermalent: -990.271232 hartree
zpe.sumelectthermalfe: -990.350091 hartree
dipole: 0.9652 4.1335 2.4311
dipole: 4.8916
quadrupole: -85.6661 -123.0161 -117.2287
quadrupole: 10.0238 -3.4949 -2.6134
quadrupole: 22.9709 -14.3791 -8.5917 10.0238 -3.4949 -2.6134
hfenergy: -990.5952894 hartree
pointgroup: C01 [X(C13H18N2O5)]
dipole: -0.4131649 1.4495794 -1.1965426 debye
polarizability: 236.6374158|-10.657013|148.0469491|-20.5278749|-26.7815965|134.4539942 unknown
InChI: InChI=1S/C13H18N2O5/c14-12(18)4-2-9(13(19)20)15-6-5-8-1-3-10(16)11(17)7-8/h1,3,7,9,15-17,19H,2,4-6,14H2
charge 0 multiplicity 1
38 atoms
O  1.383415 2.994397 0.238175
O  3.500074 2.551493 -0.584236
O  4.958834 -2.514922 0.646994
O  -5.156902 -1.726123 1.671834
O  -6.572205 0.046341 0.209443
N  1.347482 0.002401 -0.052959
N  6.37319 -1.618949 -0.955531
C  2.295991 0.807689 0.758282
C  3.631172 0.054489 0.944679
C  -0.096408 0.220648 0.187009
C  -0.93441 -0.678439 -0.756231
C  4.335176 -0.35678 -0.37098
C  -2.429098 -0.483774 -0.550842
C  2.502848 2.164919 0.064044
C  -3.115725 -1.209208 0.456953
C  -3.150619 0.452843 -1.332524
C  5.236808 -1.579472 -0.163717
C  -4.488876 -1.002218 0.678096
C  -4.533336 0.667985 -1.117774
C  -5.196309 -0.059298 -0.113997
H  1.878595 1.027111 1.769869
H  3.429168 -0.867126 1.524682
H  4.315206 0.672986 1.553764
H  -0.330444 1.281553 -0.006585
H  -0.387419 0.015967 1.246749
H  1.594132 -0.995957 -0.005045
H  -0.661709 -1.738297 -0.57603
H  -0.646788 -0.442961 -1.797347
H  3.572952 -0.634475 -1.126339
H  4.892359 0.495397 -0.794346
H  -2.595413 -1.947507 1.076454
H  -2.63354 1.016004 -2.117393
H  -5.082868 1.392056 -1.732819
H  1.532967 3.849754 -0.251099
H  6.610663 -0.860537 -1.592243
H  6.98575 -2.432041 -0.893175
H  -6.111565 -1.450822 1.679011
H  -7.035351 0.70247 -0.363431
