program: Gaussian 09
title: 000194009
version: EM64L-G09RevD.01
frameworkgroup: C1[X(C11H9ClN2O3)]
method: RPBEPBE
basis: SDD
operation: Freq
keyword: #p
keyword: freq=noraman
keyword: PBEPBE/SDD
title: #p freq=noraman PBEPBE/SDD
converged: YES YES NO NO
title: Mulliken charges:
elementType: Cl O O O N N C C C C C C C C C C C H H H H H H H H H
charge: -0.053632 -0.278546 -0.436986 -0.222651 -0.281322 -0.036036 0.419494 0.360988 -0.467178 0.058563 -0.340341 -0.355454 -0.072371 -0.196438 -0.253920 0.147832 -0.504745 0.290843 0.324485 0.297936 0.232585 0.259379 0.236876 0.248662 0.236947 0.385032
chargesum: 0.00000
title: Mulliken charges with hydrogens summed into heavy atoms:
elementType: Cl O O O N N C C C C C C C C C C C
charge: -0.053632 -0.278546 -0.051954 -0.222651 -0.281322 -0.036036 0.419494 0.360988 -0.176335 0.058563 -0.015856 -0.057519 -0.072371 0.036147 0.005459 0.147832 0.217740
polarizability: 2.35150542e+02 4.42060463e+00 1.86910308e+02 -5.58373247e-02 -2.23269421e-01 6.30395665e+01
1716.lowfreq: -8.4148 -5.0159 -3.0656 -0.0019 -0.0017 -0.0006 9.7102 50.6643 70.5884
frequency: 8.8680 50.6599 70.5794 80.0920 117.9575 141.3679 143.7263 177.7527 181.7667 194.2641 244.7975 271.7636 291.2069 352.4267 366.7486 401.4842 413.5380 444.9945 479.1338 552.4274 569.3145 589.7412 635.0277 637.0404 644.7906 662.1720 685.2065 699.6078 743.2187 768.1951 786.7532 814.6099 904.4091 921.8800 948.9945 963.3690 978.9275 981.9295 1022.1612 1045.1283 1074.1573 1086.3843 1117.3707 1120.4902 1133.5952 1158.6481 1183.0884 1233.4191 1268.7376 1292.8532 1357.5761 1382.3306 1410.0797 1426.3638 1439.1314 1449.2594 1461.4894 1469.8052 1478.3972 1547.4742 1583.6206 1606.3446 1674.4020 2981.5773 3079.4924 3144.5928 3147.8421 3178.3020 3196.8777 3209.9803 3263.1055 3532.7868
redmass: 5.5861 9.2282 5.0586 11.1997 4.6081 4.1403 2.4444 4.4990 8.9352 1.6500 3.7303 5.1179 7.6140 5.2428 6.8514 8.9075 8.0857 3.2834 7.4419 2.4285 2.2814 5.3939 5.2333 3.1436 6.5251 5.7391 2.3519 6.5672 4.7544 5.8748 1.4001 1.5570 1.3526 1.4383 8.8944 9.9239 1.3268 6.1803 4.6379 3.2713 2.1105 1.8914 1.2495 1.3883 3.0887 1.4558 1.0924 3.6817 2.0171 1.5082 5.1175 10.3431 2.3292 2.9474 3.0307 2.6650 1.0498 1.1618 2.7921 5.5846 7.4705 6.7771 9.0922 1.0314 1.1054 1.1020 1.0889 1.0959 1.0928 1.0943 1.0992 1.0642
irintensity: 0.4608 1.8142 3.7037 0.3628 0.7540 1.1840 0.6943 0.0017 1.7211 0.1811 2.5818 3.5115 8.6368 4.8796 3.8954 4.5932 0.5027 7.0237 1.3469 34.6241 52.5617 41.4416 31.8985 60.6203 4.6424 1.4441 30.4530 28.3499 32.0538 50.9149 52.9619 42.4838 0.4681 27.0873 71.1542 25.0149 1.1827 4.2962 295.1815 107.3013 20.0140 33.5942 0.1705 113.7091 2.2877 33.5638 2.8754 81.4358 21.6150 6.2859 68.4717 0.7233 177.1483 52.4384 9.5226 100.4150 16.6750 30.5972 98.9886 115.5385 92.0572 107.6773 269.0068 52.1260 31.3330 11.4709 11.5879 3.9992 6.5381 3.3066 4.6532 51.8675
temp: 298.150 k
press: 1.00000 atm
elementType: 17 8 8 8 7 7 6 6 6 6 6 6 6 6 6 6 6 1 1 1 1 1 1 1 1 1
symmnumber: 1
zpe: 482559.3 jmol-1
zpe.correction: 0.183797 hartree
zpe.thermalcorrener: 0.199177 hartree
zpe.thermalcorrenthalpy: 0.200121 hartree
zpe.thermalcorrgfe: 0.138615 hartree
zpe.sumelectzpe: -1218.561222 hartree
zpe.sumelectthermal: -1218.545843 hartree
zpe.sumelectthermalent: -1218.544898 hartree
zpe.sumelectthermalfe: -1218.606405 hartree
dipole: -3.0152 6.8093 0.0305
dipole: 7.4471
quadrupole: -87.5412 -98.7154 -107.6363
quadrupole: -1.4522 -0.1563 0.0164
quadrupole: 10.4231 -0.7511 -9.6720 -1.4522 -0.1563 0.0164
hfenergy: -1218.7450194 hartree
pointgroup: C01 [X(C11H9Cl1N2O3)]
dipole: 0.57005 -2.8684554 -0.1772119 debye
dipolederiv: -0.2896054 0.2444794 0.0294471 0.3717641 -0.6849545 -0.061839 0.037208 -0.0532057 -0.0757585 -0.3866862 -0.1028662 0.0042829 0.170621 -1.6388742 -0.0753297 0.0149726 -0.0578014 -0.258237 -1.417312 0.2407719 0.0786898 0.3649524 -0.3868571 -0.0220512 0.0843658 -0.0138093 -0.438554 -0.6915927 -0.1725153 0.0171485 -0.2713062 -1.0678278 -0.0187499 0.0119568 -0.0261869 -0.3140652 -1.1180233 0.1111736 0.0819886 -0.3381534 -0.3844963 0.0020083 0.0575416 -0.0263883 0.005409 0.4081242 0.3351167 -0.0213921 0.5642136 -0.3501781 -0.0470964 -0.0053303 -0.0322747 -0.1566855 1.2750747 -0.1766538 -0.090961 -0.1603943 0.1892694 0.0191776 -0.0910458 0.0201269 0.0743419 0.5536784 0.3516932 -0.0157055 -0.216756 1.3635177 0.0745687 -0.041969 0.0388747 0.1089484 -0.3886735 -0.2156622 -0.000264 -0.0771656 -0.2599732 0.0053604 0.0056668 0.0134914 -0.251135 -0.9187285 -0.3409868 0.0482582 -0.2236009 0.1195434 0.0190891 0.0520281 0.0266591 0.0323167 -0.3673762 0.1824805 0.0279187 0.2721061 -0.3176878 -0.0307798 0.0327986 -0.0253548 -0.1096362 -0.3499967 0.0140434 0.0126848 -0.0735217 -0.073047 0.0103847 0.0082795 0.0043302 -0.1647904 0.4199406 -0.404021 -0.0565538 -0.6278441 1.079012 0.1105338 -0.0704988 0.0950734 -0.0512151 0.1775009 -0.0098451 -0.0225047 0.0813491 0.1196478 0.0105574 -0.0164521 0.0161463 -0.1394756 -0.1489631 0.0688222 0.0056103 0.1442371 -0.3425757 -0.023293 0.0109082 -0.0179024 -0.1220696 2.1557266 0.2290264 -0.1180488 0.4430637 1.4610131 0.0300544 -0.1067144 0.0459027 0.2507662 0.3316755 -0.4308458 -0.0212805 -0.205516 0.7766887 0.0346707 -0.0102415 0.0472749 0.3170644 0.0863265 0.0736969 0.0123469 0.0603658 0.0809318 -0.0107136 0.0118647 -0.0119634 0.2168241 0.1804079 -0.055695 -0.0035672 -0.0569577 0.0956906 -0.0011753 -0.0043997 -0.0007661 0.1771996 0.1729667 0.0067497 0.0015673 0.0301778 0.027012 -0.0112711 0.0033267 -0.009965 0.175556 -0.0014872 -0.0717879 0.0063478 -0.0955347 -0.0470983 -0.0056894 0.0049068 -0.0072471 0.1544734 -0.0452959 0.0186106 0.0160313 0.0300664 0.102046 -0.0062722 0.0164737 -0.0053091 0.1710098 -0.0069228 0.1262864 0.0972424 -0.0070669 0.0405359 0.0577889 0.0949596 -0.0207503 -0.0752372 0.0422936 -0.1089462 0.0012638 -0.0436965 -0.0780414 -0.0057098 0.0040566 -0.0014112 0.1277526 -0.0311564 0.1356771 -0.0907304 -0.0064664 0.044175 -0.0495618 -0.1008745 0.0125786 -0.0530695 0.3581043 -0.0488025 0.0001793 -0.1289367 0.132528 -0.0046618 -0.0037877 -0.0101227 0.3982667 unknown
polarizability: 233.9240704|-5.6664538|186.9328631|-12.0137551|7.0692321|64.2434838 unknown
InChI: InChI=1S/C11H9ClN2O3/c1-17-10-6-9(11(15)16)13-14(10)8-4-2-3-7(12)5-8/h2-6,15H,1H3
charge 0 multiplicity 1
26 atoms
Cl -3.911123 2.985152 0.415192
O  0.41177 -2.653809 -0.189707
O  4.549269 0.766923 -0.298445
O  3.24302 2.689093 -0.114899
N  0.148514 -0.255933 -0.0553
N  0.916085 0.912053 -0.048717
C  -1.279426 -0.135065 0.049334
C  0.965509 -1.391422 -0.165306
C  2.292541 -0.953862 -0.233005
C  2.204462 0.471915 -0.156179
C  -1.820278 1.171413 0.164008
C  -2.12781 -1.270134 0.038947
C  -3.212164 1.307817 0.267829
C  -3.523192 -1.085159 0.146235
C  -4.088279 0.20379 0.262353
C  3.314765 1.443592 -0.181943
C  1.389675 -3.754077 -0.294389
H  3.201008 -1.540446 -0.322814
H  -1.151392 2.033665 0.169267
H  -1.708985 -2.272333 -0.050702
H  -4.181437 -1.960152 0.13872
H  -5.169092 0.346293 0.345048
H  1.961233 -3.670677 -1.236849
H  0.789101 -4.674133 -0.291691
H  2.07657 -3.740273 0.571492
H  5.277255 1.444669 -0.313181
