program: Gaussian 09
title: 000194008
version: EM64L-G09RevD.01
frameworkgroup: C1[X(C8H4ClF3N2O2S)]
method: RPBEPBE
basis: SDD
operation: Freq
keyword: #p
keyword: freq=noraman
keyword: PBEPBE/SDD
title: #p freq=noraman PBEPBE/SDD
converged: NO NO NO NO
title: Mulliken charges:
elementType: Cl S F F F O O N N C C C C C C C C H H H H
charge: 0.045018 0.890659 -0.165098 -0.142414 -0.142409 -0.491809 -0.491810 -0.422890 -0.185296 -0.270136 0.652336 0.467533 -0.539168 -0.181255 -0.313882 0.274023 -0.162358 0.279603 0.303989 0.337325 0.258041
chargesum: 0.00000
title: Mulliken charges with hydrogens summed into heavy atoms:
elementType: Cl S F F F O O N N C C C C C C C C
charge: 0.045018 0.890659 -0.165098 -0.142414 -0.142409 -0.491809 -0.491810 -0.085565 -0.185296 -0.270136 0.652336 0.467533 -0.259565 0.122733 -0.313882 0.274023 0.095683
polarizability: 2.00773170e+02 -1.48202416e+01 1.62044942e+02 8.45923291e-04 5.63858841e-04 8.01049750e+01
1716.lowfreq: -26.4727 -13.5037 -7.1300 -0.0023 0.0022 0.0025 2.2525 41.8050 55.5503
frequency: -26.0376 41.3269 55.4633 103.3045 127.3273 139.5056 152.7562 199.8055 210.7336 237.2144 255.5617 278.4222 303.7669 311.0350 345.9834 401.1940 415.4332 424.5101 441.4629 457.1949 474.9839 479.1794 508.0295 561.8599 617.1682 622.5545 655.9682 680.1597 689.9622 737.1498 821.7241 839.8571 868.9035 874.0973 896.6425 907.3094 962.6102 1007.0304 1019.1098 1028.9825 1080.6589 1111.7288 1225.3547 1255.6308 1270.3008 1340.5491 1342.5449 1400.4411 1459.2624 1494.1029 1558.2927 1584.4597 1618.3429 3095.3216 3158.8288 3170.0872 3543.4598
redmass: 12.4600 16.6384 10.3769 8.7163 13.1206 10.0401 22.9386 16.3407 8.5535 5.8632 11.0774 16.2422 6.6770 14.6783 10.5360 9.2698 9.8654 15.1545 13.1892 3.7074 14.1096 5.8832 5.3103 8.5010 1.2503 10.8040 9.4482 8.2289 8.2737 2.9873 14.1044 9.7438 1.5154 7.2581 1.4683 1.6104 13.1520 6.3819 11.8171 10.2345 6.6299 2.4276 2.2259 1.2449 3.6608 1.3538 4.7812 6.0889 3.6896 3.0321 3.6546 5.0533 6.8776 1.0887 1.0921 1.0934 1.0778
irintensity: 0.2541 0.0557 6.8610 0.2983 8.3778 0.3908 0.2835 0.3980 0.6000 0.0126 4.3802 10.2677 3.0778 9.1513 6.1713 3.0314 8.4123 37.9310 13.8306 53.2113 20.0009 5.8902 0.3300 11.6862 71.7299 25.6392 7.2774 9.1807 1.3412 0.8492 76.7973 11.5129 6.5474 66.5717 0.2658 71.3405 104.1116 92.6685 218.9185 45.8481 214.8827 14.8230 161.6893 3.8686 53.3049 31.3554 23.9177 1.4266 220.9486 225.1121 112.9614 1.2328 18.9363 6.1933 3.5218 6.7282 49.2612
temp: 298.150 k
press: 1.00000 atm
elementType: 17 16 9 9 9 8 8 7 7 6 6 6 6 6 6 6 6 1 1 1 1
symmnumber: 1
zpe: 304238.2 jmol-1
zpe.correction: 0.115878 hartree
zpe.thermalcorrener: 0.130544 hartree
zpe.thermalcorrenthalpy: 0.131489 hartree
zpe.thermalcorrgfe: 0.073524 hartree
zpe.sumelectzpe: -1723.428714 hartree
zpe.sumelectthermal: -1723.414048 hartree
zpe.sumelectthermalent: -1723.413104 hartree
zpe.sumelectthermalfe: -1723.471068 hartree
dipole: 2.1184 6.6899 0.0001
dipole: 7.0173
quadrupole: -145.9625 -93.7055 -119.6008
quadrupole: -18.5617 -0.0002 0.0003
quadrupole: -26.2062 26.0508 0.1554 -18.5617 -0.0002 0.0003
hfenergy: -1723.5445923 hartree
pointgroup: C01 [X(C8H4Cl1F3N2O2S1)]
dipole: -0.8819063 -2.6161831 -0.0019057 debye
dipolederiv: -0.3961728 0.3130359 0.0000693 0.430334 -0.4399404 -0.0001373 0.0001412 -0.0001765 0.012244 1.434515 0.1899004 0.000143 0.5571179 1.4358005 0.0002086 0.0003719 0.0000956 1.3841739 -0.4986461 -0.1697167 -0.0002018 -0.1416353 -0.73592 -0.0004407 -0.0001674 -0.0004349 -0.2847671 -0.6868418 0.0041902 0.2254081 0.0465876 -0.292429 -0.1316109 0.2363516 -0.1052376 -0.610158 -0.6865056 0.004503 -0.2254281 0.0468973 -0.2928149 0.1321473 -0.2362586 0.1057493 -0.610013 -0.5649471 -0.0404567 0.0054741 -0.1596578 -0.5357986 -0.0198375 -0.1069491 -0.128927 -0.5945017 -0.565014 -0.0405354 -0.0055093 -0.1598093 -0.5359901 0.0198143 0.1067649 0.1289758 -0.5942447 -1.2404005 0.0731546 -0.0002644 0.4247464 -0.4861808 0.0000117 -0.0000277 -0.0000938 -0.2814897 -0.4717309 -0.2403105 -0.0001702 -0.5037986 -0.6330041 -0.0002891 -0.0003236 -0.0002047 -0.4229028 -0.1251483 -0.0940341 -0.0000134 0.0865643 -0.1687126 0.0000841 0.0000899 0.0000242 -0.2571034 0.2577522 -0.5396627 -0.0002905 -0.5427739 0.3877752 -0.0000246 -0.0002907 -0.0000233 0.140577 -0.4252099 -0.0384172 -0.0001351 0.0471543 -0.0717394 0.0000251 -0.0001227 -0.0000098 -0.0909417 -0.1091737 0.2716643 0.0001714 -0.1552975 -0.070526 -0.0000213 -0.0000869 0.0001229 -0.1250514 -0.3364704 0.35472 0.0001094 -0.066291 -0.0911908 -0.0000872 -0.000151 0.0000513 0.0064884 0.5630048 -0.7117657 -0.0002446 -0.4811718 0.6126336 0.0002798 -0.0000933 0.0001966 -0.0745451 2.1249623 0.2560719 0.00036 0.1608313 1.3360383 -0.0000709 0.0002493 -0.0000476 1.531321 1.2628274 0.5419192 0.0007205 0.3405867 0.3855507 0.0003193 0.000582 0.0003709 0.0386037 0.1108363 0.0275745 -0.0000012 0.0022369 -0.0028852 -0.0001052 -0.0000201 -0.000097 0.1700785 0.1081332 -0.0388015 -0.0000353 0.0040861 0.0939185 -0.0000281 -0.0000071 -0.000043 0.1415059 0.1262815 -0.034591 -0.0000877 0.0006464 0.2282923 -0.0000685 -0.0000674 -0.000081 0.3401093 0.1179483 -0.0884424 -0.0000742 0.0626461 -0.1228773 -0.0001691 0.000015 -0.0002104 0.180617 unknown
polarizability: 200.2127206|-15.525167|162.605353|0.0294134|0.0460097|80.1050131 unknown
InChI: InChI=1S/C8H4ClF3N2O2S/c9-5-2-7-6(1-4(5)8(10,11)12)13-3-14-17(7,15)16/h1-3,13H
charge 0 multiplicity 1
21 atoms
Cl -2.29042 2.614584 0.000882
S  2.972836 0.801477 0.001468
F  -3.339007 -1.857229 -0.002599
F  -3.785507 0.047123 1.132308
F  -3.784817 0.049035 -1.134567
O  3.3225 1.530145 1.405263
O  3.323397 1.531963 -1.401159
N  1.577977 -2.040018 -0.000738
N  3.788994 -0.932702 0.000612
C  1.119096 0.391335 0.000603
C  0.678557 -0.952875 -0.000364
C  -1.637495 -0.131723 -0.000633
C  -0.716123 -1.195313 -0.000983
C  0.219727 1.468965 0.000968
C  -1.162589 1.207182 0.000366
C  -3.114871 -0.458088 -0.001356
C  2.964227 -1.965201 -0.000274
H  -1.09485 -2.222145 -0.001751
H  0.586141 2.499553 0.001711
H  1.169457 -2.976644 -0.001433
H  3.465668 -2.944624 -0.000722
