program: Gaussian 09
title: 000194005
version: EM64L-G09RevD.01
frameworkgroup: C1[X(C21H20N2O5)]
method: RPBEPBE
basis: SDD
operation: Freq
keyword: #p
keyword: freq=noraman
keyword: PBEPBE/SDD
title: #p freq=noraman PBEPBE/SDD
converged: NO YES NO NO
title: Mulliken charges:
elementType: O O O O O N N C C C C C C C C C C C C C C C C C C C C C H H H H H H H H H H H H H H H H H H H H
charge: -0.259391 -0.411808 -0.232192 -0.218568 -0.222237 -0.163324 0.016616 0.142352 0.048430 0.277303 0.288098 -0.728696 -0.754326 -0.214913 -0.411863 -0.422141 -0.383602 0.123726 -0.346441 -0.490975 0.445731 -0.262341 -0.229770 -0.341201 -0.548087 0.188241 0.376058 -0.369005 0.220752 0.208098 0.256358 0.235494 0.229890 0.230887 0.261927 0.252250 0.260470 0.237344 0.242159 0.247679 0.266275 0.273679 0.226492 0.225369 0.267188 0.291323 0.289817 0.380877
chargesum: 0.00000
title: Mulliken charges with hydrogens summed into heavy atoms:
elementType: O O O O O N N C C C C C C C C C C C C C C C C C C C C C
charge: -0.259391 -0.030932 -0.232192 -0.218568 -0.222237 -0.163324 0.016616 0.142352 0.048430 0.277303 0.288098 -0.043489 -0.058054 0.047014 0.100857 -0.184797 -0.141442 0.123726 -0.098762 0.048979 0.445731 -0.035849 -0.004401 -0.074013 -0.256764 0.188241 0.376058 -0.079188
polarizability: 4.10113914e+02 3.45081914e+01 2.23866027e+02 5.18198269e+00 1.26402204e+01 2.25017806e+02
1716.lowfreq: -7.6447 -0.0002 0.0004 0.0006 1.9331 4.9172 10.5530 11.7002 26.4583
frequency: 10.3999 11.5833 26.3051 26.7582 41.7363 59.4463 80.4437 91.8013 103.3487 114.5417 141.9689 154.2569 174.2934 187.0798 203.9576 213.6303 235.2088 252.6648 257.0662 270.4867 294.6207 306.0751 314.0277 327.3559 354.4977 386.3666 400.6945 411.0365 437.7941 444.9053 469.2599 480.6931 509.7648 515.7108 524.5725 542.1439 545.3158 553.1366 556.0252 572.9641 605.3088 616.5465 637.9598 649.5693 657.4823 688.2165 694.7176 738.5643 741.5608 750.6715 751.2133 759.4216 768.0905 786.7975 795.4953 833.5054 845.4774 854.2101 879.3406 889.1223 922.1753 930.4758 931.3013 937.7787 944.8917 971.6980 980.4246 983.7179 986.5276 1008.3272 1019.9384 1031.9278 1051.5143 1068.6853 1081.1154 1084.9974 1112.0155 1120.7004 1146.3352 1149.3164 1160.8174 1175.9114 1181.0134 1191.7179 1210.3634 1233.9043 1243.7915 1247.2559 1254.9822 1259.7617 1267.3290 1288.5708 1305.0402 1323.5093 1343.3032 1349.7887 1375.4065 1381.2386 1382.4324 1394.4385 1411.2089 1418.9268 1443.2230 1445.8164 1449.7183 1463.2937 1465.9044 1470.6528 1473.6348 1476.6068 1484.9302 1491.1179 1569.2397 1608.2067 1611.1262 1620.5356 1648.6852 1662.5053 2978.9198 2988.9562 3000.4216 3007.1642 3063.2337 3072.8570 3078.3277 3084.6485 3087.8694 3117.1798 3126.0417 3128.7121 3133.3596 3147.7642 3160.6307 3165.1822 3165.5973 3168.1871 3189.1960 3508.2224
redmass: 9.1849 10.6794 5.3243 5.7908 5.9094 9.0717 2.3061 6.1482 5.0359 3.5372 6.7787 6.8550 3.6843 4.1323 1.8898 2.1654 3.1760 2.9841 3.9083 2.1133 1.3683 3.9177 4.1728 3.2545 3.8223 7.2450 4.3873 3.4029 4.4918 3.4974 3.3394 5.2945 2.9201 3.3679 5.3579 4.0217 4.3489 6.4931 4.2281 3.7531 5.1661 3.6414 4.9102 1.4108 5.9397 5.8321 5.3821 3.0887 4.9611 1.6162 1.9011 3.2391 2.5952 2.5225 2.8706 2.9731 1.6116 1.4048 4.3447 4.6722 2.2704 3.9579 1.4758 1.4530 1.5814 1.3136 2.2102 1.3359 1.6084 1.3868 2.3912 3.1574 2.7591 2.3593 2.1556 2.2452 1.7334 1.5159 2.6595 1.7387 2.5034 1.1826 1.5817 1.8266 3.4766 2.0320 1.5382 2.1456 3.1585 1.6482 3.8562 1.3614 1.7306 2.8909 1.7713 5.1813 1.2160 1.6204 2.2560 1.2018 4.4278 10.1940 1.1721 2.4884 2.2306 1.0716 1.0716 1.4137 2.3475 1.2342 1.2308 1.6896 8.0632 7.3956 7.4180 7.2933 7.7354 8.3427 1.0350 1.0373 1.0638 1.0642 1.0950 1.0994 1.1003 1.1009 1.0995 1.0986 1.0860 1.0874 1.0893 1.0941 1.0958 1.0923 1.1001 1.0891 1.0967 1.0639
irintensity: 0.9937 0.4291 0.0804 0.2020 0.1973 0.1816 0.5655 2.7502 0.3275 0.2975 1.5833 4.2549 0.3492 0.6379 2.7744 2.6001 4.4507 0.7910 1.8399 3.8879 2.9234 1.0017 1.4285 3.2033 6.2612 8.1384 5.6189 1.4245 14.3600 19.7056 6.3557 49.8803 6.0789 39.0359 11.5554 3.9403 14.4777 8.7464 14.1412 1.7104 14.8508 2.3418 3.8985 130.3211 117.5736 61.3001 4.8194 26.5732 21.7700 47.4465 104.7340 50.5939 2.1545 10.5843 21.5951 34.7158 25.5089 0.6438 7.0042 69.1375 33.6095 199.6705 3.0595 29.7057 3.3724 0.1655 13.6000 0.3494 15.7058 12.9170 51.5256 150.0173 7.3338 16.3783 139.3426 117.5894 76.2839 85.7684 9.4176 77.8051 25.3609 15.2138 37.9341 43.4761 397.0289 130.7306 12.8917 81.9328 133.7111 2.2608 5.1881 12.8142 66.1678 41.0195 89.8284 57.5915 9.4823 108.3889 50.3003 18.8158 8.0700 27.8103 30.4736 12.3485 27.8511 7.1283 0.7087 33.4797 43.4330 41.1719 8.2513 120.1519 47.0712 13.1289 99.8938 67.0813 45.0144 194.9990 20.5639 27.3815 5.7975 10.5684 1.7710 13.5867 42.4278 12.0429 28.8251 14.3045 5.5572 4.1204 7.5628 28.1434 6.3148 2.2679 29.4465 1.2975 2.9120 24.2515
temp: 298.150 k
press: 1.00000 atm
elementType: 8 8 8 8 8 7 7 6 6 6 6 6 6 6 6 6 6 6 6 6 6 6 6 6 6 6 6 6 1 1 1 1 1 1 1 1 1 1 1 1 1 1 1 1 1 1 1 1
symmnumber: 1
zpe: 969988.7 jmol-1
zpe.correction: 0.369449 hartree
zpe.thermalcorrener: 0.394558 hartree
zpe.thermalcorrenthalpy: 0.395502 hartree
zpe.thermalcorrgfe: 0.311167 hartree
zpe.sumelectzpe: -1295.780900 hartree
zpe.sumelectthermal: -1295.755792 hartree
zpe.sumelectthermalent: -1295.754848 hartree
zpe.sumelectthermalfe: -1295.839183 hartree
dipole: -7.4898 -0.4490 2.9342
dipole: 8.0566
quadrupole: -209.5635 -150.2150 -158.6691
quadrupole: -3.9451 4.8878 3.8871
quadrupole: -36.7477 22.6009 14.1468 -3.9451 4.8878 3.8871
hfenergy: -1296.1503495 hartree
pointgroup: C01 [X(C21H20N2O5)]
dipole: -2.8364928 -0.5712668 1.2941809 debye
polarizability: 397.4342346|58.7046799|236.4882254|-5.0015192|10.3748419|225.0752875 unknown
InChI: InChI=1S/C21H20N2O5/c1-20(2)16-5-3-4-6-17(16)22(12-10-19(24)25)21(20)11-9-14-13-15(23(26)27)7-8-18(14)28-21/h3-9,11,13,24H,10,12H2,1-2H3
charge 0 multiplicity 1
48 atoms
O  0.404598 -1.089582 -0.384709
O  -2.757412 4.80746 0.97513
O  -1.827321 4.257763 -1.081033
O  6.342656 0.64578 -1.813853
O  6.187764 1.502573 0.297324
N  -1.625891 0.118277 0.160112
N  5.690497 0.869897 -0.718016
C  -1.370328 -2.079992 1.079045
C  -0.605123 -0.719522 0.762342
C  -2.502328 -2.025026 0.048036
C  -2.641221 -0.690468 -0.413187
C  -0.460107 -3.320323 0.980607
C  -2.007732 -2.010319 2.500286
C  0.124288 -0.063035 1.905553
C  -1.405649 1.51645 -0.225552
C  -3.384404 -3.018772 -0.3930
C  -3.663613 -0.319535 -1.307808
C  1.677679 -0.568633 -0.435803
C  1.428454 0.334988 1.857375
C  -2.333949 2.474811 0.558548
C  2.253711 0.137026 0.669894
C  -4.41883 -2.66902 -1.304368
C  -4.553189 -1.333804 -1.74826
C  2.421636 -0.785995 -1.624538
C  3.580029 0.606879 0.565098
C  -2.257956 3.894947 0.036058
C  4.307384 0.37759 -0.620338
C  3.739199 -0.315906 -1.719689
H  0.388669 -3.239135 1.683991
H  -1.035044 -4.225129 1.250406
H  -0.059925 -3.447412 -0.036556
H  -2.667838 -2.88364 2.640908
H  -1.233443 -2.03787 3.288493
H  -2.621841 -1.100448 2.627122
H  -0.476342 0.114748 2.802666
H  -0.352838 1.779809 -0.028536
H  -1.567374 1.645886 -1.312154
H  -3.280926 -4.054331 -0.048706
H  -3.769187 0.706527 -1.675368
H  1.880466 0.829223 2.725396
H  -2.095536 2.469249 1.636057
H  -3.38612 2.138773 0.473164
H  -5.112996 -3.435694 -1.664051
H  -5.352837 -1.074061 -2.451057
H  1.948781 -1.325648 -2.449649
H  4.056399 1.147472 1.388773
H  4.339607 -0.470356 -2.619773
H  -2.717616 5.72753 0.594917
