program: Gaussian 09
title: 000194002
version: EM64L-G09RevD.01
frameworkgroup: C1[X(C9H8N2OS)]
method: RPBEPBE
basis: SDD
operation: Freq
keyword: #p
keyword: freq=noraman
keyword: PBEPBE/SDD
title: #p freq=noraman PBEPBE/SDD
converged: NO YES NO NO
title: Mulliken charges:
elementType: S O N N C C C C C C C C C H H H H H H H H
charge: 0.146380 -0.122537 -0.375182 -0.033882 0.452189 -0.157170 -0.466043 -0.442328 -0.329765 -0.077070 -0.196548 -0.221720 -0.253784 0.323289 0.268139 0.268176 0.221128 0.311094 0.228451 0.226698 0.230483
chargesum: 0.00000
title: Mulliken charges with hydrogens summed into heavy atoms:
elementType: S O N N C C C C C C C C C
charge: 0.146380 -0.122537 -0.051893 -0.033882 0.452189 -0.157170 0.070273 -0.221200 -0.018670 -0.077070 0.031903 0.004978 -0.023301
polarizability: 2.17285751e+02 -7.10088752e+00 1.34442900e+02 -5.74692873e-04 -1.43114599e-02 5.29629698e+01
1716.lowfreq: -3.4438 -0.0026 -0.0024 0.0019 7.3596 16.6703 46.3105 57.5353 101.0116
frequency: 46.2933 57.5326 101.0003 108.5111 211.1411 234.7053 269.7952 286.0427 391.3506 409.6380 464.3700 469.3873 498.8286 531.7193 560.4826 563.7480 577.2203 613.3014 643.5242 697.3834 765.0178 794.7836 807.6295 841.7919 916.9108 932.6680 946.6473 973.4057 984.7056 1000.9760 1009.8365 1028.4070 1087.9212 1172.9341 1172.9420 1189.0857 1194.4607 1270.8306 1280.2031 1324.0106 1384.9250 1423.7690 1434.0012 1484.1504 1518.8665 1602.6321 1615.2223 1670.2557 1687.5246 2987.2945 3034.1930 3110.9992 3133.5938 3145.5155 3166.7222 3188.0249 3545.2647
redmass: 7.4294 4.8061 5.3314 6.0452 3.2906 10.0667 3.2446 6.0865 12.3440 2.9324 12.5173 3.7155 2.4112 7.1794 1.6116 7.3862 4.0605 6.5006 10.1699 2.0117 1.6643 7.1290 5.7245 1.2669 1.4190 1.9836 7.0725 1.3501 6.1689 1.3042 4.9693 2.1570 1.5670 1.0692 1.0705 1.2644 3.1411 1.9941 1.4481 1.4105 6.5623 1.0830 2.2693 2.3242 1.8284 4.6720 6.0075 9.2611 11.8983 1.0589 1.1011 1.0888 1.0868 1.0934 1.0995 1.0956 1.0765
irintensity: 0.3585 0.0693 3.3150 0.5410 2.5789 5.2566 12.1894 0.4013 7.0657 0.0000 34.9113 3.5588 46.8597 82.7519 29.8696 17.4622 17.5153 1.0676 6.9683 42.9519 94.7237 26.8350 2.3683 0.0722 12.5062 0.0240 98.7546 0.0870 0.1344 2.5825 89.4186 36.3521 23.7166 0.4416 0.3864 0.9565 1.7424 20.0495 48.7272 41.2934 54.0423 18.1187 71.3288 82.2042 330.1691 35.1721 103.9519 302.0151 405.9989 27.0331 3.3369 13.5967 0.3931 28.7053 22.7023 10.1786 34.8415
temp: 298.150 k
press: 1.00000 atm
elementType: 16 8 7 7 6 6 6 6 6 6 6 6 6 1 1 1 1 1 1 1 1
symmnumber: 1
zpe: 404123.0 jmol-1
zpe.correction: 0.153922 hartree
zpe.thermalcorrener: 0.165118 hartree
zpe.thermalcorrenthalpy: 0.166062 hartree
zpe.thermalcorrgfe: 0.115707 hartree
zpe.sumelectzpe: -929.624757 hartree
zpe.sumelectthermal: -929.613561 hartree
zpe.sumelectthermalent: -929.612617 hartree
zpe.sumelectthermalfe: -929.662972 hartree
dipole: 2.9206 -0.3700 0.0002
dipole: 2.9439
quadrupole: -92.2370 -73.0009 -86.4001
quadrupole: -5.5258 -0.0156 -0.0178
quadrupole: -8.3576 10.8784 -2.5208 -5.5258 -0.0156 -0.0178
hfenergy: -929.778679 hartree
pointgroup: C01 [X(C9H8N2O1S1)]
dipole: -1.1533911 0.1056507 0.0008724 debye
dipolederiv: -1.0548565 0.108223 0.0014191 0.2981828 -0.6094287 -0.0239707 0.0097002 -0.0246802 -0.0206014 -1.5712313 0.2912706 0.0085153 0.1148636 -0.3291546 -0.0030689 0.000629 -0.0025021 -0.2476167 -2.1642867 0.1106631 -0.0018176 -0.0080868 -0.3610998 -0.0022167 -0.0061099 -0.0020238 -0.3130343 -0.8972736 -0.1090126 -0.00644 0.3292105 -0.9514819 -0.0265169 0.0122071 -0.0283149 -0.2933548 1.3375969 0.1575083 0.0110893 0.6658489 0.124334 0.0032275 0.0325333 0.0014718 0.1097086 2.331413 0.0320988 0.008571 -0.3716522 1.024695 0.0379291 -0.0103919 0.0396821 0.0867187 0.4435694 -0.0842351 -0.0028979 -0.1118831 0.0419765 -0.0088459 -0.0041467 -0.0085959 0.2477855 -0.3800401 -0.0554515 -0.0031278 0.0671168 0.0628012 0.012955 0.0026357 0.0125185 -0.2114227 -0.2568346 -0.0098976 -0.0006724 -0.3136277 -0.1274469 0.0009457 -0.0140227 0.001651 -0.1679254 1.8312452 -0.5095097 -0.0165643 -0.7544735 0.7570919 0.0253418 -0.0266722 0.0261106 0.1020732 0.1359014 -0.0116618 0.000374 -0.0739815 0.102268 0.0109331 -0.002944 0.0112181 -0.1373665 0.0784519 -0.0151325 -0.0000481 0.0897201 0.1751858 0.0149984 0.0049977 0.0145883 -0.1413678 -0.0793633 0.0731989 0.0037127 0.0362906 -0.1281635 0.0027084 0.0019953 0.0027952 -0.1857642 0.1838772 -0.0304496 -0.0017093 -0.0519886 0.1663045 -0.0066058 -0.0019961 -0.0064109 0.3143492 -0.0336447 0.0277687 0.0300571 0.0362525 0.0690716 -0.0574513 0.0893814 -0.0909229 0.010858 -0.0330993 0.0297586 -0.028086 0.0431385 0.0563919 0.0614234 -0.0863524 0.0948367 0.0228615 0.0691177 -0.0847587 -0.0041748 -0.0545234 -0.1076504 -0.0130891 -0.0026396 -0.013125 0.1697772 0.1607185 0.0728621 0.0033533 0.0779996 0.0791521 -0.0041932 0.0038752 -0.0040116 0.1742213 -0.0553052 0.099506 0.0039553 0.115205 0.0002483 -0.0069754 0.0047214 -0.0070124 0.1578055 0.0679697 -0.0230892 -0.0013812 -0.0611408 -0.1103232 -0.0124224 -0.0032364 -0.0122198 0.1525003 -0.1139255 -0.0696597 -0.0041277 -0.0724713 0.0652283 -0.0051058 -0.0041642 -0.0050529 0.1697947 unknown
polarizability: 217.6769376|-4.2283057|133.8918134|0.3681828|3.5761899|53.1228694 unknown
InChI: InChI=1S/C9H8N2OS/c12-8-6-10-9(13-8)11-7-4-2-1-3-5-7/h1-5,11H,6H2
charge 0 multiplicity 1
21 atoms
S  2.635187 1.506056 0.114712
O  4.942841 -0.066807 0.054972
N  -0.085733 0.991361 0.085425
N  1.361935 -0.930353 0.008123
C  -1.391203 0.41842 0.055929
C  1.134388 0.350628 0.061566
C  2.770408 -1.290318 -0.002811
C  -2.491191 1.318326 0.094293
C  -1.624517 -0.980266 -0.009263
C  3.706638 -0.055296 0.051552
C  -3.810468 0.825197 0.06732
C  -2.953508 -1.456354 -0.035681
C  -4.051551 -0.567542 0.0019
H  -0.051731 2.01153 0.129209
H  3.026965 -1.86223 -0.916631
H  3.021877 -1.936128 0.861835
H  -2.313858 2.400641 0.145124
H  -0.773916 -1.663523 -0.03781
H  -4.649239 1.529204 0.097454
H  -3.127882 -2.537008 -0.086333
H  -5.077143 -0.95034 -0.019085
