program: Gaussian 09
title: 000193999
version: EM64L-G09RevD.01
frameworkgroup: C1[X(C19H27N7O5)]
method: RPBEPBE
basis: SDD
operation: Freq
keyword: #p
keyword: freq=noraman
keyword: PBEPBE/SDD
title: #p freq=noraman PBEPBE/SDD
converged: YES YES NO NO
title: Mulliken charges:
elementType: O O O O O N N N N N N N C C C C C C C C C C C C C C C C C C C H H H H H H H H H H H H H H H H H H H H H H H H H H H
charge: -0.302822 -0.290325 -0.306680 -0.246318 -0.294199 -0.135914 -0.397470 -0.371724 -0.377032 -0.072002 -0.065765 -0.612713 -0.202090 -0.468644 -0.409134 -0.466375 -0.097608 0.135686 0.257951 -0.460525 -0.177130 -0.262455 -0.452883 0.191302 -0.516610 0.152417 -0.368731 -0.257607 -0.506818 -0.271551 0.270795 0.277574 0.237455 0.231537 0.310619 0.226003 0.231883 0.253551 0.280865 0.235120 0.288088 0.254658 0.365849 0.351567 0.240110 0.227559 0.242931 0.252826 0.361060 0.350907 0.259215 0.234368 0.267676 0.220882 0.257869 0.258982 0.341444 0.322375
chargesum: 0.00000
title: Mulliken charges with hydrogens summed into heavy atoms:
elementType: O O O O O N N N N N N N C C C C C C C C C C C C C C C C C C C
charge: -0.302822 -0.290325 -0.306680 -0.246318 -0.294199 -0.135914 -0.031620 -0.010664 -0.026125 -0.072002 -0.065765 0.051106 0.075485 0.000348 0.127488 0.019059 0.183257 0.135686 0.257951 0.062684 0.077528 0.089113 0.014786 0.191302 -0.020854 0.152417 0.124853 0.010069 -0.028068 -0.012569 0.270795
polarizability: 3.10400162e+02 -2.58768007e-01 2.81535273e+02 -3.71646440e-01 -1.62281241e+00 2.05598036e+02
1716.lowfreq: -6.7107 -4.3017 -0.0006 -0.0002 0.0000 3.4970 7.8714 15.6345 20.3851
frequency: 6.9691 15.5788 20.3788 23.6905 32.9712 37.0877 46.2485 50.1524 58.8179 65.1885 68.8529 77.1491 96.0918 104.0667 110.1114 111.5334 130.1176 141.8729 154.5706 166.7140 184.2719 196.9586 216.9480 234.7614 244.1289 263.8518 281.8657 286.4475 312.0266 325.3863 342.0999 361.5994 408.1870 415.8800 457.4986 461.5768 474.3250 492.5895 507.2790 532.8565 537.6918 551.9531 560.7339 581.9274 598.3997 603.2722 611.0825 654.4774 662.2174 679.3080 681.6879 692.9175 706.1330 726.7663 748.2020 752.3437 770.1944 779.4290 792.1002 814.1009 817.2024 831.0994 843.6462 848.7707 859.4033 871.6614 875.0457 883.1430 910.1209 914.3902 924.8295 925.9215 945.3172 953.4286 977.6414 986.2400 990.2232 999.8432 1007.1237 1016.7822 1042.0215 1042.5000 1049.2886 1059.3060 1064.9812 1090.7037 1097.5771 1104.2634 1108.0210 1119.0182 1145.7132 1150.7219 1165.8119 1182.6431 1187.0092 1195.9862 1198.5312 1209.4867 1211.5448 1236.0112 1246.8504 1249.0948 1251.4542 1256.9445 1260.6942 1263.1721 1269.4269 1274.2006 1281.0273 1290.7412 1297.8720 1298.0542 1302.6307 1325.5856 1326.4785 1332.2568 1334.1819 1338.8727 1355.9587 1356.8146 1378.7602 1383.8352 1419.4861 1423.0398 1431.9181 1454.4887 1454.7616 1463.6270 1472.0346 1475.8632 1476.3930 1481.6459 1494.8451 1499.3092 1512.7953 1579.1386 1593.0796 1597.6590 1614.4590 1640.0524 1669.6347 2881.1288 2919.7350 2965.6863 2989.9691 2994.8164 3009.4287 3009.6488 3012.4731 3017.8572 3022.4980 3027.9271 3033.2627 3051.7551 3052.2306 3075.6523 3079.8232 3081.9155 3083.5696 3100.1731 3100.8062 3176.1772 3208.4011 3391.9370 3465.0709 3515.8049 3563.5021 3670.5986
redmass: 6.5403 5.8427 5.6067 5.1798 5.4500 5.5196 6.1863 4.8252 5.4515 5.3724 5.6683 7.7520 3.4218 6.5506 4.8241 4.1802 4.7828 4.4493 2.3705 4.6473 4.0954 5.0786 6.7897 4.5698 2.8023 3.6250 3.1195 2.9164 3.9956 4.5271 5.2515 5.4510 4.9489 5.4451 1.9382 3.8437 4.2171 2.1480 2.0071 3.8131 1.2767 3.7730 2.8075 2.5538 3.3722 2.3136 1.6666 2.0921 3.5277 4.5070 2.7414 3.4365 4.0078 2.7748 1.2525 1.2779 2.8865 3.2438 3.1149 2.7941 2.2793 2.8127 4.0945 3.6477 3.4617 2.2949 1.9925 2.4324 2.2965 2.1539 1.7255 2.2497 3.4605 2.5020 2.7135 2.9414 3.1740 2.0488 2.4481 2.6668 2.1030 2.2709 3.1237 2.0649 1.8118 2.2821 2.4031 3.1551 2.8233 1.7474 1.9960 1.9852 1.5281 1.5123 1.5200 1.2633 1.3180 1.4419 1.2499 1.5122 1.3189 1.7716 1.6293 1.3936 1.4236 1.5522 1.3361 1.3975 1.4516 1.3940 1.3912 1.4804 1.3473 1.4678 1.3632 1.3561 1.4720 1.4852 1.5808 1.4304 2.1264 2.4505 5.3427 6.7474 1.0974 1.1205 1.1043 1.0935 1.1025 1.1646 1.1054 2.1630 1.8895 1.1146 5.8781 10.2753 1.7004 6.0346 6.6731 2.4513 9.2058 1.0810 1.0823 1.0645 1.0617 1.0646 1.0624 1.0652 1.0636 1.0632 1.0834 1.0626 1.0840 1.0997 1.1007 1.1038 1.0981 1.1026 1.1011 1.1001 1.1063 1.0960 1.0984 1.0775 1.0788 1.0451 1.0785 1.1043
irintensity: 0.4795 0.5356 0.5767 3.0035 5.2584 0.3448 0.9335 1.8556 8.9989 1.5100 12.8317 8.8094 1.8271 4.0282 5.9011 0.6031 2.0964 2.6838 1.1013 3.4825 0.9432 10.9141 3.1001 23.0851 10.6111 4.1149 4.4786 5.8702 6.6559 7.2253 17.3509 9.9553 24.3008 21.2466 7.6468 8.7786 1.6603 18.0194 8.3530 7.3402 146.0460 23.0072 10.3640 17.6444 18.2609 40.0301 78.0984 99.6983 23.1737 26.0146 58.3126 12.8808 4.3720 29.3389 81.3820 92.5190 23.4310 1.6817 12.3881 6.1807 5.4698 14.7967 6.4585 5.2120 14.6105 16.8679 4.1973 1.7509 0.6864 27.5765 1.9583 1.2427 3.9948 42.3373 14.1076 10.5350 14.0207 10.5011 7.9523 36.2043 4.4039 29.1192 14.6359 2.2611 2.0184 5.5845 17.0314 2.7460 1.9370 2.4589 5.5347 11.2023 4.1616 88.0319 42.3659 6.8932 4.4265 34.9502 46.9084 17.9940 19.6460 193.5929 118.0450 4.9665 6.1769 5.9187 1.4946 19.6822 9.5339 19.1395 6.5548 19.2399 1.6914 4.1392 2.5711 32.5288 16.3853 17.6350 56.6621 11.1847 108.9404 109.5443 156.8500 14.0199 25.4794 38.9690 32.9455 24.3927 32.2966 114.6139 45.4967 491.7238 264.8771 28.8047 31.9239 274.9825 82.4281 116.1386 176.4526 273.1665 515.7373 243.4011 40.5042 36.2319 26.5283 26.2547 2.7391 17.7413 26.6236 14.8867 10.9498 26.6140 23.6065 32.6480 18.3843 9.6691 4.2156 14.2757 19.5914 17.1908 35.4974 4.4012 12.4777 164.9123 188.0471 44.4797 57.7865 29.3738
temp: 298.150 k
press: 1.00000 atm
elementType: 8 8 8 8 8 7 7 7 7 7 7 7 6 6 6 6 6 6 6 6 6 6 6 6 6 6 6 6 6 6 6 1 1 1 1 1 1 1 1 1 1 1 1 1 1 1 1 1 1 1 1 1 1 1 1 1 1 1
symmnumber: 1
zpe: 1226157.9 jmol-1
zpe.correction: 0.467019 hartree
zpe.thermalcorrener: 0.497497 hartree
zpe.thermalcorrenthalpy: 0.498441 hartree
zpe.thermalcorrgfe: 0.398806 hartree
zpe.sumelectzpe: -1497.317559 hartree
zpe.sumelectthermal: -1497.287081 hartree
zpe.sumelectthermalent: -1497.286137 hartree
zpe.sumelectthermalfe: -1497.385772 hartree
dipole: -14.1524 -1.7646 -1.0845
dipole: 14.3032
quadrupole: -170.7232 -200.3747 -171.5428
quadrupole: 17.9187 -2.0064 16.2643
quadrupole: 10.1571 -19.4945 9.3374 17.9187 -2.0064 16.2643
hfenergy: -1497.784578 hartree
pointgroup: C01 [X(C19H27N7O5)]
dipole: 5.5880442 -0.3796651 -0.5441199 debye
polarizability: 309.4962693|-5.4563816|276.4017609|-1.6432368|-20.569658|211.635442 unknown
InChI: InChI=1S/C19H27N7O5/c20-15(27)5-6-22-18(30)14-2-1-7-26(14)19(31)13(8-11-9-21-10-23-11)25-17(29)12-3-4-16(28)24-12/h9-14,22,24-25H,1-8,20H2
charge 0 multiplicity 1
58 atoms
O  0.517393 1.177655 -0.467639
O  2.510609 -1.751203 -0.46975
O  -4.224964 0.004349 0.021863
O  -6.907624 4.125746 -0.539521
O  6.335622 1.633265 -0.53274
N  0.935895 -0.236211 1.321975
N  -2.08834 0.828406 -0.408719
N  4.08869 -0.032347 -0.527609
N  -5.416546 2.32659 -0.888329
N  -2.065879 -3.101616 1.445026
N  -2.65469 -4.891402 0.021546
N  8.330372 0.785939 -1.341019
C  2.394491 0.020393 1.254187
C  2.929857 -0.634233 2.561014
C  0.568569 -1.178511 2.420632
C  1.929146 -1.789215 2.82032
C  -1.337852 -0.224471 0.297549
C  0.113658 0.299089 0.374732
C  2.984909 -0.66433 -0.008782
C  -1.364828 -1.600559 -0.455565
C  -4.0252 2.075086 -1.277495
C  -2.457466 -2.543941 0.112603
C  -3.344388 3.466548 -1.058366
C  -3.449522 0.886009 -0.482675
C  -4.511543 4.473637 -1.219916
C  -5.772053 3.667359 -0.835298
C  4.81721 -0.53895 -1.697408
C  -2.778566 -3.781525 -0.696604
C  6.332567 -0.670546 -1.422405
C  -2.212732 -4.407509 1.318573
C  6.982133 0.675342 -1.065926
H  2.590313 1.106584 1.207671
H  3.97192 -0.977847 2.454061
H  2.892919 0.103926 3.383426
H  -0.167896 -1.931767 2.094568
H  0.124697 -0.6078 3.261966
H  1.935969 -2.135385 3.867132
H  2.159734 -2.641944 2.159375
H  -1.766453 -0.365607 1.307545
H  -1.563642 -1.399455 -1.523122
H  -0.378739 -2.095647 -0.393297
H  -3.964798 1.795496 -2.353803
H  -1.47476 1.530168 -0.85231
H  -3.377526 -1.924973 0.25289
H  -2.937541 3.520304 -0.03272
H  -2.518154 3.642107 -1.767775
H  -4.620784 4.825144 -2.263228
H  -4.424761 5.363105 -0.576364
H  4.427127 0.866763 -0.162784
H  -6.033386 1.559863 -0.61267
H  4.384282 -1.522124 -1.948892
H  4.653086 0.137275 -2.558895
H  -3.107402 -3.805583 -1.73883
H  6.829007 -1.116564 -2.305346
H  6.488463 -1.364584 -0.573248
H  -2.015299 -5.122914 2.118179
H  8.811451 1.649041 -1.085882
H  8.857546 0.035782 -1.784401
