program: Gaussian 09
title: 000193997
version: EM64L-G09RevD.01
frameworkgroup: C1[X(C8H12N2O)]
method: RPBEPBE
basis: SDD
operation: Freq
keyword: #p
keyword: freq=noraman
keyword: PBEPBE/SDD
title: #p freq=noraman PBEPBE/SDD
converged: YES YES NO NO
title: Mulliken charges:
elementType: O N N C C C C C C C C H H H H H H H H H H H H
charge: -0.435697 -0.580031 0.003178 -0.185704 -0.429901 0.426756 -0.355661 -0.312162 -0.522266 -0.200915 -0.335702 0.212579 0.212377 0.196901 0.175554 0.263723 0.239200 0.261470 0.267644 0.281178 0.230456 0.343610 0.243412
chargesum: 0.00000
title: Mulliken charges with hydrogens summed into heavy atoms:
elementType: O N N C C C C C C C C
charge: -0.092087 -0.031209 0.003178 0.026875 -0.020624 0.426756 0.083617 -0.072962 -0.260796 0.029541 -0.092290
polarizability: 1.32171647e+02 -1.14532904e+00 8.03968376e+01 -1.53425585e+00 1.58764024e+01 8.31738568e+01
1716.lowfreq: -20.2848 -13.3642 -11.0698 0.0003 0.0005 0.0006 15.9882 73.4383 94.9283
frequency: 14.7842 73.4218 94.8780 119.0228 176.2129 190.1435 230.0118 265.6135 332.7585 348.1531 384.0248 397.9709 477.1432 548.2566 593.3380 605.5271 638.3401 724.6178 774.9499 815.0732 863.2722 923.5542 938.5190 957.8832 968.8734 986.5675 989.7695 1006.9007 1031.9125 1074.5680 1097.1683 1102.5164 1145.4009 1156.9133 1193.0199 1226.3580 1263.5375 1294.2883 1310.4091 1314.8003 1320.6920 1345.5316 1360.5715 1379.8963 1415.8994 1456.5915 1476.7209 1481.7976 1553.4683 1583.0457 1644.0963 2896.6548 2939.1718 2982.3712 3012.6765 3106.1468 3115.6131 3126.9070 3134.8929 3163.4271 3470.5056 3540.6324 3597.9912
redmass: 4.6219 4.6971 2.6694 3.1612 2.0793 1.9832 1.5664 3.3523 4.0746 1.2023 3.2961 3.3193 2.7650 3.4671 2.1459 2.6242 3.7524 1.8460 3.5882 1.7515 1.8620 1.3603 1.4796 1.8128 1.9302 1.4001 4.0443 3.5971 2.6740 2.6945 2.6440 1.7152 1.3316 1.4522 1.4420 1.6439 1.3257 2.0935 1.6636 1.5651 1.3925 1.2473 1.2414 1.3708 1.9961 2.0678 1.0967 1.0853 5.2534 5.8274 1.0940 1.0699 1.0701 1.0831 1.0907 1.0935 1.0910 1.0876 1.0920 1.0999 1.0452 1.0659 1.0980
irintensity: 1.5290 1.7320 3.2333 1.5708 5.7801 17.5583 19.9567 2.3806 12.8184 142.5568 24.0381 1.0853 19.8596 2.8572 118.5406 97.4296 18.2328 37.1075 3.9967 24.9876 3.2012 0.2545 0.7971 13.8033 31.2692 0.3301 63.3321 6.3218 0.4486 14.7860 30.2012 5.6141 5.7338 35.9306 2.6537 2.3389 16.5640 0.2824 5.7520 3.9244 0.9986 6.6744 15.2210 9.4009 26.1527 18.4879 7.6282 3.1565 4.7038 0.1202 43.0844 87.7045 44.2556 13.5930 53.2846 10.1165 20.6195 2.0540 22.7419 25.3706 0.3852 2.5253 2.1040
temp: 298.150 k
press: 1.00000 atm
elementType: 8 7 7 6 6 6 6 6 6 6 6 1 1 1 1 1 1 1 1 1 1 1 1
symmnumber: 1
zpe: 500970.8 jmol-1
zpe.correction: 0.190810 hartree
zpe.thermalcorrener: 0.202130 hartree
zpe.thermalcorrenthalpy: 0.203075 hartree
zpe.thermalcorrgfe: 0.152314 hartree
zpe.sumelectzpe: -495.907217 hartree
zpe.sumelectthermal: -495.895896 hartree
zpe.sumelectthermalent: -495.894952 hartree
zpe.sumelectthermalfe: -495.945712 hartree
dipole: -0.9322 -4.0704 -1.2318
dipole: 4.3537
quadrupole: -65.9401 -70.8918 -64.1358
quadrupole: 6.1645 -9.6996 2.1631
quadrupole: 1.0491 -3.9025 2.8534 6.1645 -9.6996 2.1631
hfenergy: -496.0980265 hartree
pointgroup: C01 [X(C8H12N2O1)]
dipole: 0.3336887 1.4179428 -0.9011022 debye
dipolederiv: -0.1980389 -0.162865 0.098333 -0.0421604 -0.8740943 -0.023637 0.1079019 -0.0119733 -0.5101537 -0.8116354 0.0795634 -0.0068882 0.066675 -0.6231875 -0.1296073 -0.0092459 -0.1025977 -0.212084 -0.3669676 -0.0083871 0.0121115 -0.0050265 -0.2344219 0.016639 0.0093128 0.0253534 -0.3008494 -0.0989516 0.0589517 0.0370684 -0.0033319 -0.160191 -0.0101024 0.2226078 -0.0472648 0.0933061 0.6604415 0.0024291 0.0142712 0.164216 0.3075218 0.0914983 0.0019716 0.0375785 0.2074176 0.3388426 -0.0810725 0.0368547 -0.037109 -0.1069611 0.0526347 -0.0377568 0.0507099 -0.1898159 0.1203554 0.0720436 -0.0475374 -0.050379 0.6405574 -0.0695088 -0.0937035 -0.0197456 0.3958051 0.009316 0.0067623 -0.0138129 0.0524343 -0.0966891 -0.0724053 -0.0821813 -0.0771374 0.0762363 0.0219106 0.0128502 -0.0348043 -0.0636155 -0.0565569 -0.1003438 0.1472957 -0.1222071 0.2453326 -0.1734646 -0.0109484 0.0386092 -0.070132 -0.0816979 -0.0489686 0.1787861 -0.046826 0.0320007 0.3393471 -0.0194991 0.0636454 0.0382938 -0.0686808 -0.0504578 -0.1054915 -0.0488232 0.0561249 0.0220353 0.0119751 -0.0032353 -0.0094724 0.0533106 0.0141239 -0.0724853 -0.0053521 -0.1402777 -0.136057 0.1141117 0.0205367 0.1156629 -0.1729271 -0.0556408 0.0522886 -0.0798262 0.025698 0.0273048 -0.005611 -0.0316488 0.0107199 0.078472 -0.0105898 -0.0358925 0.0378577 -0.1608074 0.0543388 -0.0068844 -0.0878109 -0.0188201 -0.0366162 0.0664452 -0.0288252 0.0304839 -0.2027565 -0.0850838 0.0299976 0.0210874 0.0831159 0.0973631 0.0209317 0.0015475 0.0221772 0.0804375 0.035923 -0.0353939 0.1044942 -0.0290638 0.1083315 0.0451378 0.1020514 0.0473441 0.0011525 0.0249324 0.0259931 -0.0863148 0.0298956 0.1061544 0.0453299 -0.0954366 0.0499977 -0.0174067 0.1691554 -0.0375164 0.0227599 -0.0388812 0.318018 -0.035651 -0.0420809 -0.0099372 0.0174645 0.1312987 -0.0911646 -0.0207809 -0.2023656 0.1626517 0.116306 -0.0478524 0.0865691 0.177364 0.0366094 0.0264254 -0.0704117 0.0351669 0.1306074 0.0730071 -0.0984709 0.0741193 -0.045689 0.0085376 0.0025804 -0.0260271 -0.0330862 0.3791943 0.0464485 -0.0568761 0.0920104 0.280669 -0.1301498 0.0156589 -0.0404992 0.0072634 0.1298415 0.0184103 -0.0174644 0.0174893 0.0908315 unknown
polarizability: 132.2077643|0.2855105|72.3523811|1.6771264|-12.8178898|91.1821964 unknown
InChI: InChI=1S/C8H12N2O/c9-4-8(6-11)7-2-1-3-10-5-7/h1-3,5,8,11H,4,6,9H2
charge 0 multiplicity 1
23 atoms
O  1.363866 -2.480558 0.133275
N  3.450936 1.241109 0.079326
N  -2.458672 -0.222796 1.087679
C  1.278939 0.029006 0.229072
C  2.020203 1.30199 -0.270425
C  -0.233412 0.136814 0.084201
C  1.81857 -1.235974 -0.494636
C  -0.854572 0.566765 -1.11924
C  -1.093447 -0.245769 1.148524
C  -2.262747 0.60366 -1.203067
C  -3.024053 0.200524 -0.080773
H  1.511938 -0.103853 1.306159
H  1.488845 2.196146 0.133248
H  1.94955 1.362316 -1.374492
H  1.534241 -1.202666 -1.570073
H  2.915723 -1.249981 -0.413549
H  -0.247509 0.869555 -1.98024
H  -0.66685 -0.580491 2.102729
H  3.640499 1.286477 1.084959
H  4.053886 1.869546 -0.457134
H  -2.766362 0.935182 -2.116862
H  0.373584 -2.518578 0.0957
H  -4.119656 0.212274 -0.10698
