program: Gaussian 09
title: 000193996
version: EM64L-G09RevD.01
frameworkgroup: C1[X(C19H25NO2)]
method: RPBEPBE
basis: SDD
operation: Freq
keyword: #p
keyword: freq=noraman
keyword: PBEPBE/SDD
title: #p freq=noraman PBEPBE/SDD
converged: YES YES NO NO
title: Mulliken charges:
elementType: O O N C C C C C C C C C C C C C C C C C C C H H H H H H H H H H H H H H H H H H H H H H H H H
charge: -0.442325 -0.441973 -0.322435 -0.096009 -0.195040 -0.352141 -0.399348 0.366321 -0.700930 -0.551165 -0.584488 -0.413833 0.504560 0.169203 0.334192 -0.398022 -0.412317 -0.412825 -0.784509 -0.227779 -0.228456 -0.243590 0.207750 0.219638 0.243202 0.205684 0.182422 0.200383 0.230658 0.211988 0.208061 0.229032 0.201481 0.202520 0.263308 0.289602 0.332643 0.227801 0.230851 0.230072 0.212399 0.237243 0.238937 0.223200 0.222864 0.227062 0.354112
chargesum: 0.00000
title: Mulliken charges with hydrogens summed into heavy atoms:
elementType: O O N C C C C C C C C C C C C C C C C C C C
charge: -0.109682 -0.087861 -0.079233 0.111740 0.024598 0.035964 0.031693 0.366321 -0.051850 -0.147165 -0.321180 -0.124231 0.504560 0.169203 0.334192 -0.170220 -0.181466 -0.182753 -0.095930 -0.004579 -0.005592 -0.016528
polarizability: 2.64102276e+02 1.53879825e+00 2.43338944e+02 -1.00383113e+01 1.48594338e+01 1.50716737e+02
1716.lowfreq: -12.0253 -6.7234 -5.9449 -4.2625 -0.0009 -0.0006 -0.0004 10.0415 15.9053
frequency: -6.8345 9.5218 15.7959 28.5955 38.9340 56.8059 89.2517 92.6495 96.1581 104.3931 128.5744 151.2176 165.8237 181.7877 201.9470 227.0851 257.3867 276.3465 299.2261 309.6841 332.5756 334.1030 361.5792 365.2477 378.0492 402.9501 407.4982 422.3106 449.3754 495.5973 513.3460 532.2482 541.3023 567.8963 583.1346 617.8303 628.2548 646.6074 705.2891 711.9968 741.8970 757.6915 759.2013 760.4520 809.9915 831.2141 850.3340 854.8467 862.8449 878.0921 899.5256 916.3912 946.9314 955.3808 966.7441 975.2301 989.9476 993.0593 999.3348 1021.2554 1027.6186 1038.2353 1046.4332 1051.0635 1062.1395 1082.1760 1088.3379 1109.7946 1120.7272 1140.3244 1152.8610 1159.6768 1169.8800 1171.7091 1186.3856 1199.8832 1216.5090 1224.0058 1233.9213 1261.4756 1264.4668 1268.4890 1279.7011 1293.8792 1313.6091 1326.3931 1326.8896 1336.8315 1351.6157 1371.0710 1381.6951 1382.5108 1384.4327 1397.1040 1407.7987 1440.1802 1448.7409 1457.0932 1462.5971 1468.4001 1472.3823 1473.6016 1480.9499 1483.7196 1494.9050 1509.6602 1590.6957 1593.1671 1614.6186 1623.9434 2866.2618 2963.0450 2971.2915 2977.8713 2980.6954 2981.6825 2988.4582 2989.8848 3022.6725 3054.6403 3059.7536 3073.6992 3089.7688 3095.6691 3112.7108 3114.3596 3114.6268 3123.0887 3130.6314 3142.3390 3161.3859 3165.8263 3421.6833 3534.3578 3578.3131
redmass: 3.7891 4.6013 4.4569 4.1311 4.3385 3.1472 3.4342 1.9010 2.8894 1.1123 4.0342 2.2536 3.6274 2.2043 2.0402 4.1092 4.0416 3.1173 3.7170 2.7828 1.7958 2.0400 2.2120 3.0961 1.2853 2.8181 2.4044 3.9303 2.8398 3.4243 4.3034 4.4856 3.2931 4.8349 4.0315 6.3561 4.8938 1.5388 1.7369 3.4432 4.3966 1.8044 1.4642 1.9579 3.8027 1.5014 1.3259 1.4921 1.4624 1.5051 2.2520 1.4508 3.2888 1.6379 1.8031 1.3876 6.2902 1.3155 1.7180 2.9822 2.2468 1.7655 1.5237 3.0365 2.8611 1.8442 2.0711 1.5045 2.6395 2.0888 1.6312 1.2158 1.4050 1.0709 1.1152 1.4288 2.3623 2.2424 1.3877 1.3236 2.6083 1.5148 1.1028 1.3814 1.2476 1.3790 1.2904 1.4327 1.2102 1.5985 2.1552 7.3102 1.5250 1.4819 2.6975 2.1733 1.1661 1.0454 1.0578 1.0921 1.1044 1.0930 1.1456 2.0980 1.0942 3.0229 6.1390 6.0364 6.1867 7.0521 1.0696 1.0827 1.0624 1.0660 1.0386 1.0364 1.0832 1.0801 1.0994 1.1029 1.0969 1.0993 1.1003 1.0980 1.0872 1.0868 1.0907 1.0898 1.0906 1.0958 1.1015 1.0943 1.0737 1.0657 1.0658
irintensity: 0.0678 0.0175 0.8204 0.1169 0.5827 0.3406 0.3767 1.0450 0.5547 0.0344 0.4736 0.6460 0.4408 2.8082 0.7530 0.4642 9.1129 6.1929 22.0919 24.5374 20.5944 14.2244 87.2598 28.0112 82.3329 0.0195 35.8080 1.8478 13.6153 20.5685 25.7158 10.2757 2.4287 19.5184 5.7365 0.0620 8.8201 80.4285 54.6481 0.6707 17.5169 12.5852 10.7063 49.2484 4.4168 36.6984 3.5500 10.9509 11.2662 16.3255 1.4363 1.7929 47.1931 29.2461 15.2126 0.0248 0.0749 0.3448 23.3548 0.8021 4.3662 12.2864 7.1469 12.7867 3.1403 49.7432 86.9869 6.2184 14.1063 107.1765 8.8291 48.8528 25.3467 2.4911 0.2362 26.3400 0.1629 12.0048 8.7728 0.6325 39.1302 25.7110 0.5834 11.0663 15.2367 3.3232 0.8352 3.8159 32.8614 5.1337 3.3828 0.1306 20.7168 28.1783 24.9289 6.3404 31.8097 11.5252 9.7701 2.5440 14.2252 9.9854 7.4264 19.1618 9.0973 49.1356 32.2276 1.4702 12.8625 13.1448 108.6572 7.5697 2.0033 30.2376 35.7638 29.8022 19.2260 79.0541 2.7041 53.1505 18.2084 39.4938 18.0880 34.9850 9.4846 9.7498 10.0206 15.7709 10.7743 46.4688 24.6024 6.3744 0.4426 6.2003 29.7253
temp: 298.150 k
press: 1.00000 atm
elementType: 8 8 7 6 6 6 6 6 6 6 6 6 6 6 6 6 6 6 6 6 6 6 1 1 1 1 1 1 1 1 1 1 1 1 1 1 1 1 1 1 1 1 1 1 1 1 1
symmnumber: 1
zpe: 1038704.1 jmol-1
zpe.correction: 0.395621 hartree
zpe.thermalcorrener: 0.417816 hartree
zpe.thermalcorrenthalpy: 0.418760 hartree
zpe.thermalcorrgfe: 0.340944 hartree
zpe.sumelectzpe: -942.553989 hartree
zpe.sumelectthermal: -942.531795 hartree
zpe.sumelectthermalent: -942.530850 hartree
zpe.sumelectthermalfe: -942.608666 hartree
dipole: -0.8121 1.0974 -0.6554
dipole: 1.5144
quadrupole: -130.3743 -131.0740 -130.1292
quadrupole: 3.4197 -4.1243 1.5177
quadrupole: 0.1515 -0.5481 0.3966 3.4197 -4.1243 1.5177
hfenergy: -942.9496107 hartree
pointgroup: C01 [X(C19H25N1O2)]
dipole: -0.3390974 0.3957019 -0.2888041 debye
polarizability: 261.8231811|0.1165195|245.6305037|-19.0086064|1.882016|150.7042732 unknown
InChI: InChI=1S/C19H25NO2/c1-14-10-11-17(13-18(14)21)19(22)15(2)20-12-6-9-16-7-4-3-5-8-16/h3-5,7-8,10-11,13,15,19-22H,6,9,12H2,1-2H3
charge 0 multiplicity 1
47 atoms
O  3.664149 2.825301 -0.300754
O  6.258568 -1.436061 0.476978
N  0.103699 1.619938 -0.012226
C  1.257722 2.249048 -0.707486
C  2.56041 1.910571 0.086755
C  -1.180615 1.587946 -0.743681
C  -2.236611 0.780063 0.036951
C  3.041908 0.454249 -0.008716
C  1.102292 3.780536 -0.899445
C  -3.606156 0.737646 -0.695792
C  4.407603 0.184215 0.27212
C  2.198588 -0.628321 -0.35828
C  -4.658114 -0.037707 0.084058
C  4.907439 -1.133167 0.197889
C  4.080046 -2.229258 -0.166091
C  2.723104 -1.939345 -0.43639
C  -4.820416 -1.435137 -0.101494
C  -5.472552 0.612747 1.047234
C  4.648799 -3.629795 -0.243575
C  -5.766258 -2.164074 0.65463
C  -6.419761 -0.110773 1.806407
C  -6.569478 -1.503821 1.613178
H  1.324678 1.768748 -1.707058
H  2.390296 2.185229 1.147724
H  -0.009867 1.991694 0.942252
H  -0.998748 1.105759 -1.726103
H  -1.596726 2.603129 -0.961612
H  -2.379647 1.227378 1.042287
H  -1.862405 -0.247904 0.201083
H  0.148318 4.008475 -1.408884
H  1.110627 4.296008 0.079853
H  1.926903 4.203889 -1.496585
H  -3.95077 1.777141 -0.865811
H  -3.459394 0.280985 -1.694614
H  5.065188 1.016965 0.554886
H  1.135211 -0.436539 -0.522558
H  4.006855 2.528566 -1.18369
H  2.058432 -2.768214 -0.709138
H  -4.203715 -1.953457 -0.846837
H  -5.366592 1.694771 1.198119
H  3.871816 -4.356645 -0.535926
H  5.475852 -3.68469 -0.975392
H  5.074965 -3.941329 0.727917
H  -5.879604 -3.242463 0.49435
H  -7.042627 0.409678 2.543093
H  -7.305351 -2.066336 2.198763
H  6.748837 -0.61754 0.739013
