program: Gaussian 09
title: 000193993
version: EM64L-G09RevD.01
frameworkgroup: C1[X(C21H23Cl2NO6)]
method: RPBEPBE
basis: SDD
operation: Freq
keyword: #p
keyword: freq=noraman
keyword: PBEPBE/SDD
title: #p freq=noraman PBEPBE/SDD
converged: YES YES NO NO
title: Mulliken charges:
elementType: Cl Cl O O O O O O N C C C C C C C C C C C C C C C C C C C C C H H H H H H H H H H H H H H H H H H H H H H H
charge: -0.004793 -0.028242 -0.285748 -0.278714 -0.239320 -0.282126 -0.244446 -0.234164 -0.427071 -0.389284 0.097670 0.141122 0.694323 0.230724 0.181778 0.152377 -0.753385 -0.818390 0.111418 -0.362856 -0.389841 -0.080585 -0.233194 -0.252049 -0.225017 -0.497042 -0.484252 -0.344695 0.271114 -0.681011 0.307835 0.304158 0.265571 0.283900 0.190878 0.221856 0.326346 0.240798 0.240174 0.230696 0.258537 0.259440 0.243343 0.239591 0.240071 0.236495 0.246145 0.245617 0.215315 0.216084 0.209176 0.223178 0.210492
chargesum: 0.00000
title: Mulliken charges with hydrogens summed into heavy atoms:
elementType: Cl Cl O O O O O O N C C C C C C C C C C C C C C C C C C C C C
charge: -0.004793 -0.028242 -0.285748 -0.278714 -0.239320 -0.282126 -0.244446 -0.234164 -0.122913 -0.081449 0.097670 0.141122 0.694323 0.230724 0.181778 0.152377 -0.013036 -0.029389 0.111418 -0.362856 -0.149667 -0.080585 -0.002498 0.006488 0.277767 0.219115 0.007510 0.086704 0.271114 -0.038164
polarizability: 2.99916251e+02 -8.45427208e+00 3.07381860e+02 1.22420777e+01 -2.88977697e+01 2.40636211e+02
1716.lowfreq: -36.2914 -5.6834 -0.0007 -0.0007 0.0020 2.5185 5.4960 9.9247 14.3792
frequency: -36.1830 9.8547 14.1188 23.7387 32.0035 32.8148 36.7381 39.5105 48.0667 54.5424 72.1895 80.9021 84.3105 92.8848 95.6909 102.4948 130.9841 135.1187 146.8463 151.8802 153.5942 179.1810 196.4326 205.1474 206.3158 229.3696 231.6628 251.5867 262.1945 300.3888 318.8392 321.7429 326.7021 337.8259 344.0523 357.9791 362.5656 374.9095 402.7078 431.5729 440.4357 464.5379 503.6191 506.6347 532.9951 548.7778 571.2419 578.8954 585.5166 596.1229 610.0269 648.5991 654.1577 667.4959 705.1380 711.2811 716.1847 727.2843 735.9094 740.9018 764.3826 782.6793 802.4873 827.0184 848.0724 866.3514 882.4308 894.3937 909.8489 913.8809 935.2962 966.0363 967.0680 996.2438 1015.4499 1029.8764 1036.2198 1043.2372 1051.2128 1054.0611 1085.7931 1091.6346 1101.4167 1101.8143 1106.2076 1114.1894 1129.1749 1132.4830 1145.7689 1151.7175 1177.1673 1212.1630 1219.2631 1222.7705 1246.3358 1271.4217 1283.1142 1293.2590 1298.2288 1305.3282 1309.6829 1326.9728 1361.4192 1369.3138 1379.9753 1394.4853 1394.8293 1407.3552 1409.7632 1419.9309 1424.1820 1433.6727 1437.8655 1439.5081 1445.5696 1453.1769 1462.6489 1473.2039 1473.5634 1478.8203 1480.1682 1486.4071 1493.3071 1563.3915 1588.8939 1589.4958 1611.5041 1628.9644 1655.4073 1658.7230 2970.6492 2975.5148 2989.2921 2992.8874 3002.4439 3003.3699 3030.4391 3044.2234 3051.8830 3059.0241 3064.9966 3077.7283 3078.7102 3082.5951 3103.0429 3119.3566 3131.8227 3138.3101 3148.9855 3154.4040 3157.4876 3176.1573 3543.9816
redmass: 1.0898 5.4168 4.9129 4.7740 2.2372 4.3157 4.2402 6.0665 6.4851 8.3245 4.3034 3.3987 5.1017 2.4559 1.5630 4.6474 3.0395 4.0593 3.2906 2.3831 3.0249 3.5866 4.4119 5.9648 8.3846 2.3587 1.4813 6.5882 6.0848 4.0803 4.9183 7.2449 5.0570 3.4430 2.9566 6.4187 5.8566 4.5484 4.1812 5.7270 9.6759 7.0442 4.1438 4.2518 4.7832 3.6012 4.4264 3.2768 3.8560 4.6369 1.5786 4.3619 4.8769 6.0980 6.8267 7.2371 4.0007 5.8467 1.2003 4.0113 2.4114 6.0236 2.9576 5.6402 5.5167 1.3416 3.5958 1.4416 6.0236 3.3756 5.2149 1.3542 1.6657 5.0115 6.5029 1.5600 1.6069 5.8430 1.5173 2.5234 3.1626 2.2093 1.6538 3.1913 2.3860 1.2683 3.0981 2.8125 1.8348 1.7813 1.5299 2.3271 1.3317 1.8612 5.0718 1.0825 1.1102 1.4578 1.6515 2.6357 2.7989 2.5423 1.6555 4.4870 1.2717 1.2137 1.2483 1.1861 2.3692 1.1971 1.1149 2.3083 1.0850 1.2068 1.0598 1.0511 1.0528 1.1937 1.1059 1.0421 1.4803 1.0771 1.0565 6.3900 7.2873 7.1963 8.7078 4.6697 8.2795 8.0696 1.0401 1.0360 1.0615 1.0412 1.0296 1.0606 1.0977 1.0972 1.1004 1.0838 1.0529 1.1015 1.0994 1.0972 1.1043 1.0958 1.0960 1.0862 1.1045 1.1149 1.0931 1.0980 1.0773
irintensity: 0.1231 0.0772 0.2299 0.1321 0.3080 0.2850 1.2183 3.0348 2.9149 1.9677 0.1543 2.3689 0.4381 0.5546 0.1202 0.3985 1.8964 3.5704 2.6899 0.5732 3.5550 0.9233 3.7962 0.2127 0.4095 0.6858 0.1555 3.4054 1.9257 5.3215 13.9750 6.1721 4.3749 5.3518 12.3174 4.1318 5.4216 4.7939 8.4853 22.0949 6.6715 1.2264 4.1474 3.5692 2.2604 5.1852 4.8092 14.9927 8.5006 7.6260 43.3097 6.5365 15.6284 6.0184 45.5105 5.8881 3.9089 44.0608 21.7525 12.4364 35.2664 22.4972 6.4816 8.7391 11.3226 1.4661 317.9086 0.6982 50.8783 478.1714 139.2468 0.4547 6.7494 293.3541 33.6532 10.4178 15.1162 35.2437 10.0145 20.4209 290.2518 15.3834 1.2232 38.6863 19.1759 0.2481 28.4450 124.6425 21.6358 37.9952 5.2654 332.3431 0.1363 7.1168 20.6599 0.3117 5.0774 46.5697 10.7591 3.7465 109.1569 5.5339 22.0824 0.5768 13.9464 7.1326 86.9536 71.7437 47.2597 39.6985 44.7435 16.5257 31.0570 206.4689 17.8711 12.1932 9.6302 27.6718 23.8253 11.2764 246.0671 14.8956 25.7555 13.6129 175.2025 117.1551 52.1579 66.7050 14.7422 380.9784 35.8665 33.6607 5.9301 29.2329 41.4663 22.2319 0.8026 14.7469 0.0702 4.4618 34.8284 77.0407 45.9656 15.1330 24.9677 3.7085 6.9253 4.4865 9.5803 1.9265 8.6049 7.5523 45.8578
temp: 298.150 k
press: 1.00000 atm
elementType: 17 17 8 8 8 8 8 8 7 6 6 6 6 6 6 6 6 6 6 6 6 6 6 6 6 6 6 6 6 6 1 1 1 1 1 1 1 1 1 1 1 1 1 1 1 1 1 1 1 1 1 1 1
symmnumber: 1
zpe: 1057799.2 jmol-1
zpe.correction: 0.402894 hartree
zpe.thermalcorrener: 0.434393 hartree
zpe.thermalcorrenthalpy: 0.435337 hartree
zpe.thermalcorrgfe: 0.334447 hartree
zpe.sumelectzpe: -2238.031808 hartree
zpe.sumelectthermal: -2238.000310 hartree
zpe.sumelectthermalent: -2237.999366 hartree
zpe.sumelectthermalfe: -2238.100256 hartree
dipole: 2.1585 -3.7740 3.7300
dipole: 5.7285
quadrupole: -189.5221 -181.2896 -176.7636
quadrupole: 6.0112 4.1059 -1.0627
quadrupole: -6.9970 1.2355 5.7615 6.0112 4.1059 -1.0627
hfenergy: -2238.4347028 hartree
pointgroup: C01 [X(C21H23Cl2N1O6)]
dipole: 0.1263544 1.0712032 -1.9788962 debye
polarizability: 294.7388635|2.6778037|282.5731779|0.3367644|-47.3413913|270.6222808 unknown
InChI: InChI=1S/C21H23Cl2NO6/c1-5-7-15(25)29-10-30-21(27)17-12(3)24-11(2)16(20(26)28-4)18(17)13-8-6-9-14(22)19(13)23/h6,8-9,18,24H,5,7,10H2,1-4H3
charge 0 multiplicity 1
53 atoms
Cl -1.172092 -2.410466 3.087305
Cl 0.134805 -5.153346 2.012513
O  1.132604 2.190916 1.06876
O  -3.963359 -1.500647 1.805594
O  0.424755 0.418579 2.431839
O  -5.51278 -0.881868 0.191281
O  3.421315 1.509552 1.342806
O  3.821585 3.143414 -0.287108
N  -2.227059 1.53758 -1.412253
C  -1.814539 -0.218274 0.797707
C  -0.86075 0.945485 0.455833
C  -3.18672 -0.041377 0.118411
C  -1.181358 -1.572241 0.392665
C  -1.053436 1.726731 -0.674762
C  -3.327376 0.770952 -0.990764
C  0.245374 1.111035 1.400372
C  -0.159546 2.819017 -1.225181
C  -4.56506 0.989854 -1.83235
C  -4.33702 -0.806822 0.649477
C  -0.85971 -2.603921 1.314521
C  -0.90289 -1.80384 -0.980387
C  -0.282527 -3.812989 0.856999
C  -0.327619 -3.007011 -1.431951
C  -0.01209 -4.025404 -0.507811
C  2.324468 2.323019 1.891556
C  -5.016876 -2.317597 2.442392
C  5.166401 1.058226 -0.239734
C  6.008986 1.580755 -1.420223
C  4.099335 2.03473 0.216575
C  7.066447 0.550684 -1.868438
H  -1.953137 -0.241017 1.89081
H  -2.357544 2.11633 -2.243474
H  -0.157863 3.700201 -0.561423
H  0.88918 2.494833 -1.291775
H  -0.503857 3.13567 -2.227593
H  -4.330093 0.845697 -2.905273
H  -5.361325 0.294141 -1.538726
H  -4.941827 2.023484 -1.705687
H  -1.148041 -1.018695 -1.702938
H  -0.124282 -3.160481 -2.49675
H  0.434435 -4.970165 -0.830253
H  2.157836 1.917452 2.899885
H  2.586544 3.390874 1.855951
H  -4.509961 -2.811216 3.283138
H  -5.415526 -3.055481 1.72606
H  -5.84112 -1.67319 2.792719
H  4.661943 0.107167 -0.50305
H  5.805587 0.817122 0.632065
H  5.339332 1.831777 -2.263956
H  6.499713 2.528124 -1.12847
H  6.592808 -0.394562 -2.194789
H  7.663427 0.937371 -2.713857
H  7.765502 0.308642 -1.045751
