program: Gaussian 09
title: 000193988
version: EM64L-G09RevD.01
frameworkgroup: C1[X(C21H24N2O)]
method: RPBEPBE
basis: SDD
operation: Freq
keyword: #p
keyword: freq=noraman
keyword: PBEPBE/SDD
title: #p freq=noraman PBEPBE/SDD
converged: YES YES NO NO
title: Mulliken charges:
elementType: O N N C C C C C C C C C C C C C C C C C C C C C H H H H H H H H H H H H H H H H H H H H H H H H
charge: -0.270380 -0.389922 -0.139783 -0.438199 -0.238752 -0.110932 0.534214 0.422223 0.164964 -0.386750 -0.412311 -0.454596 -0.438807 -0.454412 -0.426858 -0.437280 -0.433705 -0.444948 -0.253962 -0.231112 -0.235330 -0.234989 -0.250712 -0.243822 0.242151 0.266307 0.281937 0.354617 0.238521 0.242269 0.227392 0.300843 0.237129 0.231888 0.234466 0.235571 0.237912 0.216947 0.223342 0.232183 0.231402 0.222832 0.225705 0.223011 0.223377 0.225066 0.227091 0.224203
chargesum: 0.00000
title: Mulliken charges with hydrogens summed into heavy atoms:
elementType: O N N C C C C C C C C C C C C C C C C C C C C C
charge: -0.270380 -0.035305 -0.139783 -0.196048 0.027555 0.171005 0.534214 0.422223 0.164964 -0.148229 -0.170043 -0.227204 -0.137964 0.014605 0.043179 0.017578 0.021819 0.009287 -0.028257 -0.008100 -0.011953 -0.009924 -0.023620 -0.019619
polarizability: 2.79569500e+02 1.00576811e+01 2.48353529e+02 1.38584301e+01 -2.48259946e+01 1.77569092e+02
1716.lowfreq: -7.4257 -3.4882 -0.0011 -0.0007 -0.0004 5.0115 13.7171 24.3292 34.7473
frequency: 10.7765 24.2047 34.4863 37.2511 42.5939 59.1914 64.5236 70.0815 85.6071 103.8982 118.4593 129.1216 151.2827 202.6751 215.6994 242.4526 318.8919 346.6361 349.1854 380.8090 398.8223 407.0228 409.2393 445.0127 459.2710 482.5004 527.4488 558.7778 581.6098 615.1393 616.7606 620.6576 647.5274 653.5238 684.1827 703.6250 707.9048 722.4069 755.3664 759.1322 770.4373 777.7929 830.5318 838.0740 846.8371 851.8498 865.3052 874.3583 881.3880 904.7376 913.7089 920.4638 937.3256 939.7761 969.9450 971.9452 980.4692 984.4452 988.8216 990.4886 991.7252 994.3514 1007.2800 1023.5396 1027.8837 1031.5022 1054.0643 1057.1114 1069.1970 1077.8932 1082.0939 1092.9778 1109.1036 1137.1007 1171.2592 1171.9218 1175.2296 1186.5945 1188.7344 1190.4670 1194.4353 1206.4948 1211.7866 1218.9122 1247.8187 1250.3699 1256.7211 1291.6801 1303.0002 1308.9472 1312.7712 1315.7894 1320.3452 1324.1807 1329.7985 1354.2665 1374.3360 1384.1651 1424.5159 1434.6864 1445.7861 1452.9760 1466.6539 1472.2478 1475.8808 1478.4422 1489.4053 1490.2200 1493.3903 1586.3821 1589.4275 1614.0695 1614.8626 1618.9367 2952.5267 2993.1863 3001.7595 3007.6594 3022.9987 3037.0958 3059.5304 3074.6583 3080.1645 3083.8700 3091.4055 3094.3264 3104.9639 3112.4333 3116.2227 3121.6559 3125.2834 3132.8644 3136.9738 3143.8541 3148.4376 3159.5812 3163.6019 3388.2500
redmass: 4.1306 4.1329 4.1629 4.5048 3.8300 2.6399 3.4122 4.7118 3.4563 3.2989 4.0789 3.9896 4.1767 4.9858 5.3958 4.8959 3.7524 3.2417 2.9476 3.1714 2.7044 2.8370 2.8786 4.1356 4.0172 3.3935 3.2323 4.1402 3.6169 6.3190 5.6822 2.5185 3.5333 4.4660 2.8746 1.7667 2.2914 2.4356 1.2918 1.6296 1.8452 1.8297 2.6035 2.1838 1.2786 2.4349 1.3731 2.8558 3.3099 3.8740 2.5326 1.6326 1.5159 1.5731 1.8474 1.6757 3.5162 2.0151 2.6966 2.9172 1.5589 2.0721 1.3400 2.8293 2.1530 1.9670 1.8563 1.8407 2.1255 1.2105 1.6150 1.5531 2.1211 2.7104 1.0539 1.0679 1.3278 1.2481 2.2233 1.1800 1.1545 1.6205 1.7434 1.1804 1.3075 1.3815 1.3584 1.3240 1.2960 1.3901 1.2885 1.4382 1.4410 1.4037 1.3435 1.6964 6.6609 5.0901 2.3204 2.2472 1.1256 2.1381 1.0818 1.1870 1.8436 1.1813 2.4277 1.0971 2.6494 6.0738 5.9287 6.7502 6.1695 7.4342 1.0643 1.0645 1.0634 1.0601 1.0644 1.0953 1.1015 1.1008 1.1036 1.0872 1.0891 1.1059 1.0875 1.0870 1.0863 1.0878 1.0860 1.0922 1.0916 1.0963 1.0953 1.1015 1.1013 1.0771
irintensity: 1.1165 0.2508 0.5410 0.5186 0.3707 1.2925 0.1748 0.5322 2.6876 4.4509 2.4549 1.4161 2.3251 5.3624 0.4794 1.1538 4.6665 0.3215 0.9384 2.8900 2.4879 0.1889 0.1692 1.7489 35.7543 15.7483 14.2194 2.1715 6.8494 1.1332 0.5438 1.8358 3.3647 6.0523 4.1305 39.9674 50.1846 16.7104 19.7865 92.9063 23.8014 25.2176 17.5290 7.3908 0.1554 5.5612 1.5248 2.6387 11.1166 5.5071 0.3843 4.3174 3.3676 18.9824 9.8403 5.3474 11.8973 2.0856 2.1057 0.4760 1.7191 3.9804 2.4286 9.3842 12.8598 10.2125 15.2860 8.2591 28.4057 1.9200 12.8412 3.1874 2.4298 6.5036 0.0427 0.5766 4.9112 1.3908 8.4335 1.8576 1.0027 2.5587 1.2440 2.8008 12.2378 1.1091 9.0626 3.8180 3.0833 5.3583 12.6088 7.2970 1.0646 0.8780 4.1070 1.3430 0.6892 1.7495 10.5388 9.2285 89.3305 1.8359 0.6252 60.1186 243.4477 95.8639 27.8488 3.4442 40.5422 1.1706 1.4047 91.3484 52.9388 102.6484 35.1438 42.9699 26.3784 40.7486 48.6587 11.2421 15.8013 3.5305 13.8455 0.0656 8.6593 86.2351 25.3266 18.4061 2.5584 4.3416 0.7296 6.1566 21.1991 35.0737 44.4404 34.9057 19.3005 184.2341
temp: 298.150 k
press: 1.00000 atm
elementType: 8 7 7 6 6 6 6 6 6 6 6 6 6 6 6 6 6 6 6 6 6 6 6 6 1 1 1 1 1 1 1 1 1 1 1 1 1 1 1 1 1 1 1 1 1 1 1 1
symmnumber: 1
zpe: 1054684.6 jmol-1
zpe.correction: 0.401708 hartree
zpe.thermalcorrener: 0.423413 hartree
zpe.thermalcorrenthalpy: 0.424357 hartree
zpe.thermalcorrgfe: 0.346532 hartree
zpe.sumelectzpe: -997.590255 hartree
zpe.sumelectthermal: -997.568550 hartree
zpe.sumelectthermalent: -997.567606 hartree
zpe.sumelectthermalfe: -997.645431 hartree
dipole: -3.1771 3.2259 -0.9994
dipole: 4.6367
quadrupole: -116.3693 -146.4561 -137.7205
quadrupole: -3.0954 4.4720 -2.2373
quadrupole: 17.1460 -12.9408 -4.2052 -3.0954 4.4720 -2.2373
hfenergy: -997.9919628 hartree
pointgroup: C01 [X(C21H24N2O1)]
dipole: -1.0542479 1.487446 0.0620209 debye
polarizability: 280.5583774|1.3954869|255.2028051|16.3172206|0.9961585|169.7309381 unknown
InChI: InChI=1S/C21H24N2O/c24-18(15-23-13-7-8-14-23)22-21-19(16-9-3-1-4-10-16)20(21)17-11-5-2-6-12-17/h1-6,9-12,19-22H,7-8,13-15H2
charge 0 multiplicity 1
48 atoms
O  -2.092128 -2.26103 -0.356111
N  -1.546006 0.01693 -0.37363
N  -4.105821 0.833119 -0.341818
C  0.869666 0.873631 -0.632912
C  0.800122 -0.544658 -1.291215
C  -0.136772 -0.176566 -0.14134
C  1.995416 1.37082 0.219649
C  1.841815 -1.616097 -1.128713
C  -2.425772 -1.038028 -0.442812
C  2.600075 0.590295 1.242264
C  3.192268 -1.398108 -1.500536
C  2.483896 2.68817 0.004291
C  1.448727 -2.897937 -0.661101
C  -3.888466 -0.603041 -0.673086
C  -4.444867 1.05019 1.104066
C  -5.255635 1.464467 -1.05899
C  -6.006017 0.927118 1.224685
C  -6.531111 1.088782 -0.24047
C  3.652046 1.114785 2.023533
C  4.138683 -2.44296 -1.404409
C  3.53691 3.213986 0.784231
C  2.396015 -3.941791 -0.565452
C  4.126773 2.428277 1.800853
C  3.743339 -3.717939 -0.936137
H  0.435724 1.652567 -1.27354
H  0.322065 -0.524155 -2.279997
H  0.09793 -0.653554 0.819302
H  -1.993853 0.946131 -0.401855
H  2.260665 -0.434876 1.424653
H  3.49976 -0.407286 -1.854501
H  2.031169 3.306784 -0.78119
H  0.397134 -3.063028 -0.393534
H  -4.109254 -0.761638 -1.745581
H  -4.531626 -1.306805 -0.102268
H  -4.120669 2.067841 1.390578
H  -3.900163 0.329748 1.737191
H  -5.28796 1.13653 -2.111489
H  -5.108756 2.561518 -1.047163
H  -6.407865 1.708701 1.89273
H  -6.301497 -0.048964 1.646799
H  -6.956383 0.137863 -0.608689
H  -7.316654 1.859699 -0.324104
H  4.105463 0.494286 2.804824
H  5.181341 -2.262978 -1.690643
H  3.89451 4.233659 0.600403
H  2.083016 -4.929655 -0.208061
H  4.943983 2.832265 2.408716
H  4.477463 -4.528569 -0.861524
