program: Gaussian 09
title: 000193962
version: EM64L-G09RevD.01
frameworkgroup: C1[X(C20H15BrN6O)]
method: RPBEPBE
basis: SDD
operation: Freq
keyword: #p
keyword: freq=noraman
keyword: PBEPBE/SDD
title: #p freq=noraman PBEPBE/SDD
converged: YES YES NO NO
title: Mulliken charges:
elementType: Br O N N N N N N C C C C C C C C C C C C C C C C C C C C H H H H H H H H H H H H H H H
charge: 0.027703 -0.288859 -0.413517 -0.112116 -0.137060 -0.628766 -0.016873 -0.026321 0.084599 0.378889 0.378014 -0.574011 -0.573691 0.426831 -0.810487 -0.809392 0.383285 -0.000422 0.454907 -0.523167 0.315551 -0.440140 -0.303734 -0.357317 -0.382939 0.403624 -0.270965 -0.261444 0.267195 0.267173 0.231445 0.251158 0.254634 0.231122 0.254910 0.250473 0.334277 0.230718 0.317197 0.257116 0.259409 0.333718 0.337274
chargesum: 0.00000
title: Mulliken charges with hydrogens summed into heavy atoms:
elementType: Br O N N N N N N C C C C C C C C C C C C C C C C C C C C
charge: 0.027703 -0.288859 -0.079240 -0.112116 -0.137060 0.042226 -0.016873 -0.026321 0.084599 0.378889 0.378014 -0.306816 -0.306518 0.426831 -0.073250 -0.072887 0.383285 -0.000422 0.454907 -0.523167 0.315551 -0.209422 0.013463 -0.100201 -0.123530 0.403624 -0.270965 -0.261444
polarizability: 4.75317483e+02 -3.50661371e+01 2.83932416e+02 -1.77342957e-01 -5.21683604e-01 1.64976585e+02
1716.lowfreq: -4.7388 -0.0006 -0.0003 -0.0003 1.0618 4.8564 9.7902 18.7539 20.8313
frequency: 9.2852 18.7509 20.8187 30.6860 47.3896 54.1695 62.6553 91.9512 111.8597 114.6343 126.3722 131.5610 133.7026 146.0556 147.8993 183.1224 204.6399 216.3759 224.5479 243.3091 252.1289 269.0595 269.8061 299.7122 306.6863 307.3666 355.3602 411.3613 422.3002 433.6125 456.0723 471.9225 488.1006 499.0428 508.9963 527.3785 529.3644 537.2238 542.8071 545.8257 552.6830 560.7942 604.6216 606.3698 636.3113 641.4571 657.8466 661.0854 705.0894 709.1680 733.8280 738.6504 752.7797 763.9514 782.9793 834.8239 842.9967 873.0231 893.9236 904.7514 936.4914 943.3732 958.2058 962.3441 1005.1233 1005.6347 1010.3065 1020.2888 1046.5299 1049.1116 1049.9819 1061.5806 1089.5999 1123.2557 1134.6769 1185.8497 1190.8931 1209.7649 1250.3512 1259.3357 1305.6558 1316.5859 1321.8747 1325.0376 1367.7477 1369.9320 1399.5938 1401.6849 1414.1957 1419.0588 1424.6405 1435.5717 1449.2975 1464.3606 1465.0215 1482.1232 1490.5570 1497.0599 1523.3447 1537.3728 1553.1917 1583.0280 1597.2563 1606.6799 1622.0598 1624.2346 2172.1127 2178.6859 2985.5124 2985.9172 3066.4064 3066.5253 3101.2214 3101.4939 3124.3554 3153.3760 3155.2455 3156.1352 3165.3652 3193.1365 3527.1752 3542.0187 3693.6833
redmass: 3.9608 7.6425 10.2620 8.2715 4.0526 8.0874 7.2983 8.7653 9.4527 7.1022 1.1898 1.6175 2.9602 2.1752 5.2344 6.7374 12.1309 8.0298 2.8742 4.2709 5.3135 7.6367 3.5155 6.4932 4.8787 5.0858 8.5126 3.0140 6.0895 5.2184 6.8423 4.9008 8.2670 1.1527 3.0752 6.7107 6.2920 1.1142 5.8783 7.6748 5.3173 3.0885 6.6258 4.8909 7.1825 10.9450 1.9648 4.1700 6.5946 2.5281 5.6771 3.7267 4.8012 8.1872 6.4212 1.4110 5.4783 1.4427 1.3145 1.5232 7.2678 4.6411 2.8296 1.3724 1.3237 2.9785 1.7183 3.9393 1.8804 1.5830 1.5213 4.8019 2.7867 1.7170 2.4579 1.8214 1.3865 2.1943 2.1490 1.3566 2.5463 3.7460 3.1103 5.0766 5.7694 7.8458 1.4005 1.2374 2.5916 3.1849 4.6500 2.3952 4.4543 1.0510 1.0523 1.1393 1.3796 2.3066 6.1512 3.5334 4.0993 3.2013 8.4795 5.4090 2.1553 3.4802 12.6268 12.6319 1.0382 1.0382 1.0960 1.0960 1.1000 1.1000 1.0895 1.0927 1.0916 1.0934 1.0960 1.0950 1.0752 1.0450 1.1051
irintensity: 0.0578 0.7951 0.1306 0.0925 0.0927 2.3570 0.0011 1.2337 0.0761 5.9600 0.5653 1.6730 2.0522 1.7173 5.6514 1.9146 0.6425 0.8070 0.1435 2.8768 2.9776 4.0563 1.2265 0.0133 2.7410 5.0926 6.2971 0.0725 1.0798 0.3425 1.6831 1.8199 2.3152 188.9621 0.0415 1.2846 0.0204 73.2206 3.0334 0.2251 0.0273 27.0390 7.2274 0.4578 1.8958 0.0414 45.8168 3.6646 1.9017 9.9748 0.9291 0.3149 15.2832 48.6194 13.8033 55.5813 0.1365 42.8932 0.0365 33.4227 31.5807 1.1805 2.0973 0.0040 0.1370 1.6310 26.0381 48.9797 0.6898 13.8965 0.9060 36.4864 0.3680 34.6361 217.2775 92.4503 27.4682 0.9511 23.6502 0.1706 29.2182 31.0040 51.0422 44.4232 107.0067 8.2972 23.0023 9.0853 0.1166 198.5212 247.1071 3.2859 506.3736 13.1213 17.1249 17.3129 59.1362 114.9743 210.0144 619.6635 495.9706 397.4318 9.1082 3.5814 524.7819 71.1366 87.9235 39.6865 23.2932 7.2470 5.0062 19.8465 15.3716 15.6927 11.8918 3.8668 4.5677 0.8827 5.4253 10.4963 39.9312 145.3133 52.6479
temp: 298.150 k
press: 1.00000 atm
elementType: 35 8 7 7 7 7 7 7 6 6 6 6 6 6 6 6 6 6 6 6 6 6 6 6 6 6 6 6 1 1 1 1 1 1 1 1 1 1 1 1 1 1 1
symmnumber: 1
zpe: 819856.4 jmol-1
zpe.correction: 0.312267 hartree
zpe.thermalcorrener: 0.338372 hartree
zpe.thermalcorrenthalpy: 0.339316 hartree
zpe.thermalcorrgfe: 0.252075 hartree
zpe.sumelectzpe: -1186.397505 hartree
zpe.sumelectthermal: -1186.371400 hartree
zpe.sumelectthermalent: -1186.370456 hartree
zpe.sumelectthermalfe: -1186.457697 hartree
dipole: 10.3360 -5.7880 -0.0011
dipole: 11.8463
quadrupole: -223.5564 -167.6097 -163.8630
quadrupole: 4.0647 -0.0400 -0.2860
quadrupole: -38.5467 17.4000 21.1467 4.0647 -0.0400 -0.2860
hfenergy: -1186.7097722 hartree
pointgroup: C01 [X(C20H15Br1N6O1)]
dipole: 4.3572578 1.6541481 -0.0121178 debye
polarizability: 481.3735874|5.7257376|277.8065276|1.4077625|-2.705788|165.0463699 unknown
InChI: InChI=1S/C20H15BrN6O/c1-11-7-14(10-23)8-12(2)17(11)28-19-16(21)18(24)26-20(27-19)25-15-5-3-13(9-22)4-6-15/h3-8,25H,24H2,1-2H3
charge 0 multiplicity 1
43 atoms
Br 5.363198 -1.049077 0.051563
O  2.303739 -1.66108 0.055503
N  0.686524 2.804682 -0.045614
N  1.446042 0.536715 0.005424
N  2.964731 2.442226 -0.02948
N  5.283522 2.166012 -0.014102
N  -3.927956 -4.513543 0.056098
N  -6.192728 2.419596 -0.055198
C  0.956442 -2.15854 0.05365
C  0.360834 -2.457014 -1.195845
C  0.352987 -2.436742 1.303998
C  -0.913572 -3.065321 -1.176278
C  -0.921189 -3.045656 1.286365
C  -1.557511 -3.360467 0.055499
C  1.067072 -2.124691 -2.49258
C  1.05105 -2.082166 2.599359
C  2.521427 -0.291797 0.026293
C  1.719344 1.874827 -0.022459
C  -0.715203 2.647477 -0.045823
C  3.848999 0.172611 0.02109
C  4.039438 1.59232 -0.007375
C  -1.494717 3.841417 -0.075497
C  -1.376037 1.386808 -0.018472
C  -2.895248 3.783276 -0.078076
C  -2.780694 1.335638 -0.021273
C  -3.560757 2.524718 -0.050995
C  -2.852622 -3.989541 0.056521
C  -4.996443 2.464029 -0.053713
H  -1.410036 -3.315485 -2.119223
H  -1.423649 -3.280503 2.230076
H  0.531443 -2.549248 -3.357263
H  1.130247 -1.02934 -2.634827
H  2.101546 -2.511344 -2.49366
H  0.509337 -2.491043 3.467817
H  2.085158 -2.469399 2.613817
H  1.114699 -0.984574 2.722981
H  1.041768 3.764503 -0.065093
H  -0.995075 4.817817 -0.096763
H  -0.781057 0.473132 0.004632
H  -3.483143 4.705909 -0.101022
H  -3.283965 0.363579 -0.000048
H  6.124368 1.593275 0.001847
H  5.347183 3.181305 -0.034654
