program: Gaussian 09
title: 000193953
version: EM64L-G09RevD.01
frameworkgroup: C1[X(C16H16ClN3O5S)]
method: RPBEPBE
basis: SDD
operation: Freq
keyword: #p
keyword: freq=noraman
keyword: PBEPBE/SDD
title: #p freq=noraman PBEPBE/SDD
converged: YES YES NO NO
title: Mulliken charges:
elementType: Cl S O O O O O N N N C C C C C C C C C C C C C C C C H H H H H H H H H H H H H H H H
charge: -0.060541 0.199606 -0.151308 -0.252124 -0.423841 -0.211467 -0.408116 -0.173941 -0.351671 -0.683053 -0.480573 -0.170252 0.100283 0.188255 -0.794525 0.345833 0.218834 -0.770643 0.108455 -0.381041 0.491152 -0.361699 -0.415609 -0.283544 -0.316289 0.361824 0.325099 0.307227 0.366323 0.274420 0.283286 0.264778 0.247974 0.220058 0.250369 0.304817 0.296502 0.284007 0.245304 0.388270 0.257791 0.359771
chargesum: 0.00000
title: Mulliken charges with hydrogens summed into heavy atoms:
elementType: Cl S O O O O O N N N C C C C C C C C C C C C C C C C
charge: -0.060541 0.199606 -0.151308 -0.252124 -0.035571 -0.211467 -0.048345 -0.173941 0.014652 -0.081734 -0.155474 0.136974 0.100283 0.188255 -0.236819 0.345833 0.218834 -0.037833 0.108455 -0.130672 0.491152 -0.077692 -0.170306 -0.283544 -0.058498 0.361824
polarizability: 3.11154378e+02 -1.33908707e+01 2.46569171e+02 -4.13681262e+01 -2.08428197e+00 1.68928117e+02
1716.lowfreq: -5.3808 -3.9254 -0.0019 -0.0017 -0.0014 4.2159 8.4882 13.2352 19.7952
frequency: 8.0463 13.1797 19.7925 32.8835 46.8267 62.7479 69.9058 77.7267 100.2996 112.9516 118.1147 137.8191 141.9292 152.1437 163.7749 170.5690 213.3350 240.3605 251.1317 261.6295 282.1298 287.8473 300.5274 327.5839 348.2503 351.8348 371.1299 389.2950 392.0357 432.0849 436.6049 452.6718 457.4621 477.8434 486.8470 497.5145 532.1135 542.1291 557.3756 589.7119 608.5976 623.0858 645.7705 656.9464 676.7613 693.1049 701.0511 721.1581 730.5076 735.5216 745.7806 787.3769 798.7199 806.3885 830.0048 846.4747 865.8228 876.6488 895.2123 925.9581 938.5428 955.0483 957.9832 993.7696 1022.7988 1023.9527 1027.1964 1063.2346 1095.4372 1103.0553 1113.2994 1129.3850 1154.4812 1170.6614 1174.8567 1179.2086 1198.0299 1206.3873 1213.8246 1227.3367 1246.0754 1247.9977 1257.4503 1289.8332 1301.3348 1302.9722 1330.1985 1332.4899 1379.9997 1397.8605 1402.3954 1416.8474 1419.2536 1459.7022 1463.1173 1469.3880 1485.8598 1583.6930 1614.8485 1625.0358 1630.5395 1641.0702 1646.6995 1736.7687 2963.7212 2975.0020 2994.2626 3044.1511 3044.9008 3060.8370 3079.8101 3133.5150 3147.1069 3165.2002 3177.6666 3399.5516 3448.0855 3498.1775 3510.4269 3574.0498
redmass: 7.8243 9.0307 7.3964 6.9104 7.7148 6.7528 7.0286 9.3800 1.6336 9.5589 3.0837 5.6781 4.8478 5.7162 2.8456 5.6665 8.2810 4.4253 6.6460 5.6841 3.5415 4.0580 4.2940 1.7798 3.5500 6.3197 5.6275 6.1873 6.8475 4.3896 3.2870 4.9681 1.1269 4.6429 5.7014 6.0244 3.9597 3.8183 4.1344 4.3129 4.1677 1.6330 3.9114 5.6424 6.4860 4.1855 3.7091 4.1685 4.0998 5.6209 2.4273 7.9930 2.1493 1.4736 1.4959 1.6986 4.8839 2.8943 1.8914 3.2084 3.5289 1.7110 2.7884 3.7692 3.0600 1.4994 2.7550 2.7940 3.1570 1.8544 1.6669 1.5354 1.8240 1.4545 1.7170 1.3965 1.7697 1.7414 1.4964 1.6390 1.8219 1.5323 1.5432 1.4271 2.1141 2.4074 1.6006 1.6220 4.7512 4.7641 1.2181 2.9423 1.0955 1.0748 1.0780 2.2489 3.2981 6.1867 6.7575 7.7962 8.4256 1.1266 7.9886 12.7898 1.0841 1.0405 1.0604 1.0839 1.0972 1.1002 1.0897 1.0951 1.0897 1.0923 1.0959 1.0773 1.0463 1.0648 1.0639 1.0976
irintensity: 0.1482 0.0950 1.1482 1.0970 0.3834 2.8903 0.3009 5.3202 1.2575 0.2766 3.9159 0.8548 0.6290 0.8182 1.9655 3.4081 0.3738 0.5253 3.8473 28.2056 16.2433 3.5710 4.1852 23.6931 4.0021 22.7090 17.2764 1.3890 4.8183 4.8750 21.2943 5.6882 129.5685 18.8749 8.2989 18.5906 18.6386 2.5118 11.2998 18.5714 24.6602 102.8869 28.0666 7.8956 32.8470 10.7957 50.6354 14.0489 23.7507 3.7590 79.2132 12.0954 19.4861 112.9415 28.6013 4.3579 15.2077 44.7665 24.8541 16.9170 38.3733 19.8783 38.5257 29.7546 18.4071 18.0806 97.7345 7.1657 148.9409 136.7730 14.0672 17.1759 35.3986 208.4725 52.1567 14.1742 18.1064 3.2271 2.7812 9.3267 25.5712 13.3839 6.0961 7.1911 120.7629 112.2175 22.7519 24.7397 56.6849 11.2559 20.7327 23.1948 17.6826 9.2082 9.8043 584.7572 83.1825 5.0746 65.8305 114.8888 168.7177 66.7290 158.8362 429.6795 30.7551 20.3834 31.6753 28.3196 17.5614 3.9187 14.0033 5.7237 5.8150 0.0202 4.0744 114.8392 0.1875 60.6150 44.2580 2.7549
temp: 298.150 k
press: 1.00000 atm
elementType: 17 16 8 8 8 8 8 7 7 7 6 6 6 6 6 6 6 6 6 6 6 6 6 6 6 6 1 1 1 1 1 1 1 1 1 1 1 1 1 1 1 1
symmnumber: 1
zpe: 801052.0 jmol-1
zpe.correction: 0.305105 hartree
zpe.thermalcorrener: 0.330634 hartree
zpe.thermalcorrenthalpy: 0.331578 hartree
zpe.thermalcorrgfe: 0.245297 hartree
zpe.sumelectzpe: -2015.889121 hartree
zpe.sumelectthermal: -2015.863592 hartree
zpe.sumelectthermalent: -2015.862647 hartree
zpe.sumelectthermalfe: -2015.948929 hartree
dipole: 4.4821 -3.4612 -4.6609
dipole: 7.3344
quadrupole: -132.7095 -160.7603 -170.0207
quadrupole: -0.2000 0.2095 3.2409
quadrupole: 21.7874 -6.2635 -15.5239 -0.2000 0.2095 3.2409
hfenergy: -2016.1942254 hartree
pointgroup: C01 [X(C16H16Cl1N3O5S1)]
dipole: -0.7491574 0.3665802 2.7624244 debye
polarizability: 259.3107284|-38.0863373|222.0908803|-69.1316181|-19.5776873|245.2500571 unknown
InChI: InChI=1S/C16H16ClN3O5S/c1-6-5-26-15-11(14(23)20(15)12(6)16(24)25)19-13(22)10(18)7-2-3-9(21)8(17)4-7/h2-4,10-11,15,19,21,24H,5,18H2,1H3
charge 0 multiplicity 1
42 atoms
Cl 4.22263 2.558368 -3.020741
S  -1.707378 -0.43411 2.425799
O  -1.320904 1.663748 -1.519282
O  0.953007 -2.730064 -0.865357
O  -4.999081 3.287731 0.075571
O  -4.533487 1.838373 -1.676683
O  5.947164 0.297525 -4.174785
N  -2.771361 0.433009 0.020071
N  0.352288 -0.657621 0.047855
N  2.650084 -0.368067 1.355496
C  -2.19334 -0.77864 0.625649
C  -1.008471 -0.683327 -0.413801
C  -1.646608 0.693023 -0.822821
C  -3.802914 1.235302 0.566111
C  -3.457941 0.162069 2.858799
C  -4.160006 1.109526 1.891433
C  1.245807 -1.673613 -0.235613
C  -5.321393 1.830643 2.546807
C  -4.464577 2.103741 -0.456335
C  2.686837 -1.389124 0.280755
C  3.557055 -0.916339 -0.884988
C  3.487769 0.426559 -1.335722
C  4.416854 -1.823228 -1.552688
C  4.283469 0.825053 -2.418073
C  5.20245 -1.410825 -2.645882
C  5.147887 -0.071134 -3.095171
H  -2.839747 -1.667827 0.588609
H  -1.094668 -1.461228 -1.193164
H  0.74228 0.12084 0.600908
H  -3.347366 0.662954 3.837432
H  -4.085542 -0.734982 3.021028
H  -6.047122 2.222131 1.821488
H  -4.951507 2.692979 3.135255
H  -5.84111 1.153077 3.251286
H  3.07179 -2.375365 0.615785
H  3.536623 0.133143 1.47116
H  2.291411 -0.71974 2.250613
H  2.816438 1.141931 -0.851966
H  4.462789 -2.866145 -1.222043
H  -5.397331 3.80919 -0.673961
H  5.866776 -2.103593 -3.169805
H  5.799548 1.255555 -4.397331
