program: Gaussian 09
title: 000017749
version: EM64L-G09RevD.01
frameworkgroup: C1[X(C7H8Cl6N6O2)]
method: RPBEPBE
basis: SDD
operation: Freq
keyword: #p
keyword: freq=noraman
keyword: PBEPBE/SDD
title: #p freq=noraman PBEPBE/SDD
converged: YES YES NO NO
title: Mulliken charges:
elementType: Cl Cl Cl Cl Cl Cl O O N N N N N N C C C C C C C H H H H H H H H
charge: 0.059754 0.150737 0.131684 0.059760 0.150718 0.131617 -0.360478 -0.360511 -0.317212 -0.317270 -0.163204 -0.138432 -0.138325 -0.584567 -0.031158 -0.031256 0.160073 0.160114 -0.639073 -0.638938 0.034978 0.320213 0.320213 0.336840 0.336866 0.345220 0.345211 0.338212 0.338212
chargesum: 0.00000
title: Mulliken charges with hydrogens summed into heavy atoms:
elementType: Cl Cl Cl Cl Cl Cl O O N N N N N N C C C C C C C
charge: 0.059754 0.150737 0.131684 0.059760 0.150718 0.131617 -0.015258 -0.015300 0.019628 0.019596 -0.163204 -0.138432 -0.138325 0.091858 0.289056 0.288957 0.160073 0.160114 -0.639073 -0.638938 0.034978
polarizability: 2.16985745e+02 -2.74113230e-03 2.30777041e+02 2.31960577e+01 8.63299029e-03 1.44720064e+02
1716.lowfreq: -7.1228 -1.7245 -0.0011 0.0006 0.0012 4.1850 17.8180 20.3060 27.1845
frequency: 17.8046 20.2185 27.1809 34.4294 39.7612 57.3284 76.7857 134.8596 141.9771 155.0025 170.4832 174.9481 187.4477 190.3242 191.8985 217.6136 220.4351 248.9702 249.0526 262.2659 263.5667 300.1987 307.9040 336.3415 341.9662 371.7297 374.3348 380.4942 419.6821 471.4236 501.5789 502.4607 516.7369 548.2622 557.0612 569.8697 576.2461 624.4273 631.1982 651.7643 666.2434 712.7682 714.6105 757.2922 757.4002 769.8761 798.1256 814.6465 902.3767 931.3756 937.5893 987.6172 993.9397 1027.7520 1034.9708 1089.5532 1139.4393 1161.8790 1244.7230 1246.8590 1250.6483 1274.5319 1294.8346 1358.1390 1391.5639 1396.8939 1400.9394 1445.1281 1489.6019 1515.9977 1531.7048 1556.8108 1625.6134 3097.5539 3099.0318 3516.3578 3516.4893 3539.3465 3540.0526 3556.3133 3714.9180
redmass: 20.1662 16.2000 20.1459 12.9019 10.7007 10.0355 9.9260 9.0998 11.4333 9.0768 12.3147 14.5697 18.4077 9.6182 8.6585 5.2865 7.7490 10.5114 11.1538 17.5530 11.6271 10.3057 8.1841 1.2665 1.3268 6.1355 12.2985 6.3732 6.4946 3.9564 5.0190 1.2186 5.2947 1.0477 6.1791 3.3001 3.5782 1.6739 1.4689 4.3891 7.2545 8.4164 7.9779 9.9359 9.8333 8.5862 11.6862 6.5692 12.6062 5.1483 4.7994 8.0148 3.3933 3.7832 5.7875 4.6965 2.6984 2.4106 2.3329 1.4421 1.4365 1.3438 2.1137 2.2410 1.4487 1.1073 1.4908 3.7658 3.9197 3.6340 2.8103 2.7562 2.1622 1.0853 1.0849 1.0656 1.0656 1.0768 1.0767 1.0446 1.1059
irintensity: 0.0120 0.0630 0.0077 0.0035 0.8526 0.0347 0.1905 0.3809 1.2012 7.3019 0.9434 1.3273 0.0562 0.0468 3.3116 4.8136 0.3618 1.4948 5.2421 0.9617 2.2082 5.5145 8.3320 111.6883 123.2150 5.2428 7.5903 4.5060 25.0609 2.9337 4.4188 228.0410 206.7352 0.1894 3.6869 42.6090 44.5148 290.0492 61.9358 141.0065 69.2664 16.0599 11.7613 141.4597 87.8028 36.9364 76.5518 135.2359 4.6837 42.8147 198.3888 52.2195 141.9329 22.3805 3.2905 41.1714 68.5178 29.2737 15.6986 150.5632 27.3367 59.8274 7.7372 18.1442 9.4191 15.5525 0.6667 193.6243 1434.9056 286.1072 365.7914 1010.9836 192.4121 69.5618 6.3080 27.1440 7.1610 122.2966 4.2366 136.1124 51.4750
temp: 298.150 k
press: 1.00000 atm
elementType: 17 17 17 17 17 17 8 8 7 7 7 7 7 7 6 6 6 6 6 6 6 1 1 1 1 1 1 1 1
symmnumber: 1
zpe: 459770.0 jmol-1
zpe.correction: 0.175117 hartree
zpe.thermalcorrener: 0.198009 hartree
zpe.thermalcorrenthalpy: 0.198953 hartree
zpe.thermalcorrgfe: 0.119084 hartree
zpe.sumelectzpe: -3509.279515 hartree
zpe.sumelectthermal: -3509.256623 hartree
zpe.sumelectthermalent: -3509.255679 hartree
zpe.sumelectthermalfe: -3509.335548 hartree
dipole: 0.0024 4.6296 0.0005
dipole: 4.6296
quadrupole: -161.9591 -145.3757 -162.0339
quadrupole: -0.0084 11.0979 0.0001
quadrupole: -5.5029 11.0805 -5.5776 -0.0084 11.0979 0.0001
hfenergy: -3509.4546321 hartree
pointgroup: C01 [X(C7H8Cl6N6O2)]
dipole: 0.0067199 -1.8214129 0.0000428 debye
polarizability: 218.3566013|-0.0534176|230.7768117|-20.9074375|-0.0910368|143.3494366 unknown
InChI: InChI=1S/C7H8Cl6N6O2/c8-6(9,10)1(20)15-4-17-3(14)18-5(19-4)16-2(21)7(11,12)13/h1-2,15-16,20-21H,14H2
charge 0 multiplicity 1
29 atoms
Cl -5.218465 0.649256 0.588045
Cl -3.797461 3.208797 -0.218596
Cl -3.667159 0.803666 -2.033582
Cl 5.214002 0.691728 -0.587166
Cl 3.772399 3.24063 0.216598
Cl 3.659803 0.835923 2.033311
O  -2.384243 1.41019 1.837921
O  2.374644 1.430508 -1.839329
N  -2.318365 -0.568703 0.41627
N  2.324161 -0.548972 -0.417677
N  0.002506 -0.484387 -0.000866
N  1.213381 -2.588632 -0.225321
N  -1.190293 -2.598913 0.223816
N  0.020149 -4.59074 -0.000322
C  -2.413066 0.869985 0.486336
C  2.406981 0.890358 -0.487709
C  -1.122538 -1.233758 0.207341
C  1.133845 -1.22409 -0.20915
C  -3.682957 1.370361 -0.269249
C  3.672339 1.401354 0.268482
C  0.014243 -3.222881 -0.000623
H  -1.520492 1.300023 0.005093
H  1.510579 1.313106 -0.007116
H  -3.142053 -1.155493 0.570389
H  3.152589 -1.129183 -0.571398
H  -3.155411 1.052859 2.354179
H  3.148631 1.078831 -2.355238
H  -0.85041 -5.090492 0.161111
H  0.894963 -5.083032 -0.161649
