program: Gaussian 09
title: 000017663
version: EM64L-G09RevD.01
frameworkgroup: C1[X(C11H14BrCl2N)]
method: RPBEPBE
basis: SDD
operation: Freq
keyword: #p
keyword: freq=noraman
keyword: PBEPBE/SDD
title: #p freq=noraman PBEPBE/SDD
converged: YES YES NO NO
title: Mulliken charges:
elementType: Br Cl Cl N C C C C C C C C C C C H H H H H H H H H H H H H H
charge: 0.013135 -0.067893 -0.069100 -0.131878 -0.533906 -0.323735 -0.327032 0.491620 -0.582809 -0.575010 -0.364905 -0.446430 -0.177998 -0.171009 -0.221203 0.234270 0.221941 0.250471 0.232881 0.235430 0.236085 0.279749 0.261784 0.268056 0.264805 0.255317 0.242407 0.252112 0.252844
chargesum: 0.00000
title: Mulliken charges with hydrogens summed into heavy atoms:
elementType: Br Cl Cl N C C C C C C C C C C C
charge: 0.013135 -0.067893 -0.069100 -0.131878 -0.077695 0.159617 0.144483 0.491620 -0.041276 -0.042149 -0.109588 -0.204023 0.074113 0.081836 -0.221203
polarizability: 2.27925903e+02 1.62865890e+01 1.27342610e+02 -6.48584427e+00 -2.45461715e-01 1.31053609e+02
1716.lowfreq: -5.0033 -1.8590 0.0019 0.0022 0.0026 3.3938 17.9663 24.0457 30.9049
frequency: 17.8645 23.6311 30.9033 35.7857 71.1220 77.9992 87.5152 128.0758 142.0201 192.8032 196.1337 236.9326 247.0522 275.2304 323.8050 354.4463 370.9312 408.6708 429.0897 469.9324 512.0289 623.7695 634.8525 667.5645 671.4595 710.2872 772.0370 778.0519 794.7157 828.3498 838.0522 845.3607 948.1474 974.5035 981.2654 995.4226 999.7775 1002.8696 1058.7893 1061.0504 1064.3429 1088.4660 1106.2785 1116.6931 1179.2307 1180.4409 1209.6897 1231.9619 1244.6291 1250.7868 1264.9013 1282.7027 1297.7388 1304.9263 1354.5755 1362.1903 1369.2536 1382.8607 1398.6080 1449.3437 1451.1356 1467.0315 1473.7539 1477.0405 1481.0999 1582.5583 1598.2322 2886.7026 2938.8805 2947.5616 3001.6973 3054.5382 3055.2184 3059.2725 3064.7139 3126.0788 3140.7827 3144.7508 3146.8128 3167.1608 3170.2849
redmass: 13.2672 8.0497 8.7844 4.2503 3.9556 3.1720 2.5394 5.8075 3.7587 4.6980 5.7925 4.5072 5.0780 5.8500 4.2521 2.7514 3.8656 2.9001 3.8327 3.4193 3.2371 6.9110 5.4042 6.1530 6.1173 3.6886 1.1638 1.1520 2.6329 1.8675 1.2506 3.6213 1.4088 1.4574 1.7738 2.7951 2.0615 1.4178 2.5778 3.4176 2.8774 1.7567 1.4838 1.5542 1.4396 1.1182 2.5467 1.5524 1.1890 1.3431 1.3542 1.1622 1.3083 1.2835 2.0312 1.3589 1.4500 3.6489 1.9040 1.0907 1.0939 1.6329 1.1757 1.2414 1.0982 7.2727 6.1830 1.0702 1.0686 1.0683 1.0883 1.0841 1.0642 1.0660 1.0857 1.0899 1.0888 1.1118 1.1111 1.0953 1.0961
irintensity: 0.3172 0.8830 1.2162 0.4085 0.4247 2.2010 1.7450 1.7153 0.9845 7.6310 1.3776 3.0771 0.6214 1.1968 1.6751 0.3442 20.7595 0.4988 0.6443 21.0389 13.4236 0.4641 28.9845 70.0398 89.9243 3.6166 9.7801 10.4000 24.9893 49.5664 1.3918 14.0469 7.1197 4.6488 12.9093 71.5653 9.5364 3.7327 22.5024 1.8558 16.5309 34.5134 21.3467 19.8576 6.9726 1.8621 0.3382 27.5531 19.7077 16.6844 1.6196 7.2266 6.8964 14.2506 14.6751 1.4129 2.9673 4.5412 14.3829 4.7137 6.1060 73.0282 8.2043 10.5769 20.8744 1.2877 12.7773 69.1418 37.1555 62.1448 17.0457 10.7896 9.9290 25.3297 19.8510 9.6949 6.2678 15.5733 19.3621 9.2296 0.5307
temp: 298.150 k
press: 1.00000 atm
elementType: 35 17 17 7 6 6 6 6 6 6 6 6 6 6 6 1 1 1 1 1 1 1 1 1 1 1 1 1 1
symmnumber: 1
zpe: 594503.5 jmol-1
zpe.correction: 0.226434 hartree
zpe.thermalcorrener: 0.242916 hartree
zpe.thermalcorrenthalpy: 0.243860 hartree
zpe.thermalcorrgfe: 0.176856 hartree
zpe.sumelectzpe: -1414.746456 hartree
zpe.sumelectthermal: -1414.729975 hartree
zpe.sumelectthermalent: -1414.729030 hartree
zpe.sumelectthermalfe: -1414.796034 hartree
dipole: 0.0468 -1.4218 1.6453
dipole: 2.1750
quadrupole: -133.9827 -130.6984 -104.4376
quadrupole: -2.3226 -1.4639 -1.2851
quadrupole: -10.9431 -7.6588 18.6020 -2.3226 -1.4639 -1.2851
hfenergy: -1414.9728905 hartree
pointgroup: C01 [X(C11H14Br1Cl2N1)]
dipole: 0.0550956 -0.4072705 0.7505667 debye
polarizability: 226.3511837|16.8815762|128.1529876|-13.2666145|-0.287037|131.8179503 unknown
InChI: InChI=1S/C11H14BrCl2N/c12-11-3-1-10(2-4-11)9-15(7-5-13)8-6-14/h1-4H,5-9H2
charge 0 multiplicity 1
29 atoms
Br 5.309527 -0.20695 -0.945231
Cl -1.861514 3.817864 -1.336327
Cl -4.81087 -2.537994 -0.324615
N  -1.627424 0.036657 0.348153
C  -0.606994 -0.567086 1.236364
C  -1.577811 1.51228 0.2396
C  -2.978813 -0.554578 0.466323
C  0.81633 -0.441075 0.699555
C  -1.825341 1.928833 -1.216534
C  -3.115461 -1.716337 -0.528792
C  1.100819 -0.694445 -0.665667
C  1.885738 -0.112401 1.566577
C  2.42194 -0.630025 -1.158758
C  3.216943 -0.043674 1.093229
C  3.467578 -0.305495 -0.268251
H  -0.857503 -1.641582 1.338427
H  -0.6498 -0.13843 2.266551
H  -0.57478 1.860428 0.541625
H  -2.316672 2.011822 0.904576
H  -3.741583 0.209998 0.234585
H  -3.191388 -0.91685 1.495661
H  -1.014282 1.594299 -1.878524
H  -2.803133 1.594865 -1.596385
H  -3.067013 -1.371306 -1.571708
H  -2.378076 -2.513954 -0.351405
H  0.274778 -0.93444 -1.344023
H  1.686592 0.095816 2.624919
H  2.633543 -0.828527 -2.21346
H  4.036271 0.213885 1.770438
