program: Gaussian 09
title: 000193922
version: EM64L-G09RevD.01
frameworkgroup: C1[X(C7H16NO)]
method: RPBEPBE
basis: SDD
operation: Freq
keyword: #p
keyword: freq=noraman
keyword: PBEPBE/SDD
title: #p freq=noraman PBEPBE/SDD
converged: YES YES NO NO
title: Mulliken charges:
elementType: O N C C C C C C C H H H H H H H H H H H H H H H H
charge: -0.434934 -0.094330 -0.394466 -0.343005 -0.092443 -0.443823 -0.431619 -0.538634 -0.553642 0.289950 0.289427 0.265197 0.267969 0.233035 0.268476 0.242761 0.255661 0.233636 0.269735 0.270277 0.264884 0.269997 0.264604 0.268753 0.372532
chargesum: 1.00000
title: Mulliken charges with hydrogens summed into heavy atoms:
elementType: O N C C C C C C C
charge: -0.062402 -0.094330 0.184911 0.190162 0.140592 0.067414 0.057678 0.266263 0.249712
polarizability: 8.84004083e+01 -4.34059802e-01 7.89475766e+01 -2.96121861e-01 5.18595718e-01 7.06774441e+01
1716.lowfreq: -22.1163 -14.3861 -0.0006 -0.0005 -0.0004 23.2820 124.8562 138.0232 163.8512
frequency: 124.8302 137.9940 163.7304 231.8275 266.9519 274.9208 282.5193 320.3536 326.1679 408.8318 422.9915 439.0499 465.6228 483.7113 554.8175 704.4928 813.4985 859.8182 872.5511 880.1567 905.2360 952.8985 964.7501 979.0962 1014.2481 1064.1534 1082.0975 1085.3878 1108.5721 1131.1317 1165.3558 1190.7217 1210.2968 1223.1117 1251.5708 1288.1161 1304.4529 1314.1655 1333.9541 1348.5928 1357.9329 1369.1667 1402.2259 1421.2515 1441.1004 1451.7582 1454.2202 1463.7156 1472.2826 1475.3165 1481.1003 1482.7874 1492.3657 2955.2932 3004.0662 3009.8606 3021.8100 3023.7333 3031.0758 3035.1741 3065.4322 3074.1956 3099.0500 3113.2933 3139.1827 3143.3038 3143.9366 3161.8844 3583.2210
redmass: 2.7210 1.9125 1.2595 1.1931 1.1387 2.1797 1.9836 2.8886 2.3071 3.0930 2.3323 2.3957 3.1832 2.3957 2.2898 2.7308 2.2358 1.7154 2.1800 2.8586 2.1812 2.3481 2.0961 1.9654 2.6809 1.9480 1.6800 1.2680 1.6976 1.2378 1.9935 1.3035 1.6191 1.5322 1.4913 1.2491 1.3740 1.2558 1.3169 1.3851 1.4137 1.3621 1.4911 1.1682 1.1296 1.0758 1.0792 1.0515 1.0951 1.0654 1.0651 1.0739 1.0596 1.0845 1.0626 1.0640 1.0451 1.0465 1.0369 1.0563 1.0987 1.1028 1.1075 1.1083 1.1057 1.1051 1.1051 1.1036 1.0671
irintensity: 6.4055 0.1378 1.0985 0.8254 160.4330 3.9772 7.2615 3.2293 3.6304 1.4634 1.6130 0.1037 1.4670 7.2829 2.8076 1.9521 2.7767 12.4778 36.1097 26.8400 28.7937 17.9440 15.4581 3.3140 67.1488 0.8646 3.1106 2.7186 1.2292 2.5707 0.4337 10.8946 4.4475 15.5480 8.0619 3.4402 2.9291 3.2860 2.6408 4.1164 14.8383 2.0349 8.2749 15.0291 2.7516 3.1091 8.4446 6.1213 27.6786 36.4266 49.7036 26.7077 38.0979 39.8047 12.1798 13.7238 1.0884 8.4305 4.6998 4.2049 4.6796 20.0199 7.7660 5.2579 0.0182 6.0009 4.1163 4.4888 33.4611
temp: 298.150 k
press: 1.00000 atm
elementType: 8 7 6 6 6 6 6 6 6 1 1 1 1 1 1 1 1 1 1 1 1 1 1 1 1
symmnumber: 1
zpe: 600061.7 jmol-1
zpe.correction: 0.228551 hartree
zpe.thermalcorrener: 0.238471 hartree
zpe.thermalcorrenthalpy: 0.239415 hartree
zpe.thermalcorrgfe: 0.194724 hartree
zpe.sumelectzpe: -405.307255 hartree
zpe.sumelectthermal: -405.297336 hartree
zpe.sumelectthermalent: -405.296391 hartree
zpe.sumelectthermalfe: -405.341082 hartree
dipole: 3.5283 1.0243 1.0438
dipole: 3.8193
quadrupole: -34.9098 -49.1536 -48.2901
quadrupole: -4.5876 -3.5044 -1.4859
quadrupole: 9.2080 -5.0358 -4.1723 -4.5876 -3.5044 -1.4859
hfenergy: -405.5358064 hartree
pointgroup: C01 [X(C7H16N1O1)]
dipole: -1.3907685 0.3787223 -0.4245959 debye
dipolederiv: -0.6802449 0.2617769 -0.1366212 0.2856459 -0.5944342 -0.1479915 -0.1431823 -0.1133338 -0.3817973 -0.4176152 -0.0297217 0.0189663 -0.0586136 -0.3804309 0.0057931 0.0181874 -0.0019844 -0.3084418 0.3002382 -0.132673 0.0608784 -0.225868 0.137712 0.003887 0.0839048 -0.0357928 0.075843 0.112328 0.0739992 0.0350609 0.1305539 0.4536431 0.0848166 0.0080511 0.1177002 0.1399604 0.5516715 -0.1582443 0.0610257 -0.1288454 0.4575015 0.0503293 0.0377855 0.0707163 0.3678151 0.0447318 -0.0415825 0.0111978 -0.0311378 -0.0792055 -0.0140615 0.0243286 -0.0622283 0.1285911 -0.0129554 0.01661 -0.0108372 0.0681705 -0.0958248 -0.0221516 0.0319398 -0.0063488 0.0613104 0.2284862 0.0799176 -0.1022028 0.0843829 0.120825 -0.0563797 -0.1359833 -0.0708208 0.1471181 0.0800366 -0.0008629 0.0751834 -0.0018123 0.0556694 0.0130987 0.084249 0.0200929 0.2745252 0.0460891 -0.070118 -0.0347228 -0.0419763 -0.0227549 -0.0383062 -0.0306759 -0.0561376 0.0869311 0.0716332 0.019368 0.0146566 0.0217833 0.1089365 -0.036406 0.0147507 0.003732 -0.0411804 0.1044602 -0.0160556 -0.0271335 -0.0328881 0.0355147 0.0612448 0.0059848 0.0143561 -0.0650778 -0.0936195 0.0533493 -0.0251557 0.0009715 0.0545604 -0.0086762 -0.0578243 0.0071331 0.0926876 0.00102 0.005689 -0.047916 0.0048963 -0.0097581 0.0201518 -0.0724535 0.0094888 -0.188333 0.0654004 0.0011436 0.0055379 0.0166545 -0.0512031 -0.051803 0.0125772 -0.0705043 0.0799433 0.0126901 0.0136272 -0.0311431 0.0165224 0.1267665 -0.0111524 -0.0367001 0.0458508 -0.1200178 -0.0646542 -0.0610112 0.0586054 -0.050986 0.0422244 0.0237273 0.0869521 0.033709 0.0625968 0.0887537 0.0168157 0.002951 0.0276399 0.0532364 0.0291743 -0.0397427 -0.0098486 -0.0973797 0.1030605 0.0212839 0.035059 -0.0339592 -0.019258 -0.0376106 0.0163824 -0.0796166 0.0797254 0.0721679 -0.0214917 -0.0843259 -0.0256497 0.1184513 -0.030347 -0.027814 -0.0008447 -0.0165128 0.0087474 0.0358057 0.0011382 0.0982418 0.046183 0.0390283 -0.0363708 0.0548285 0.0970337 0.1275819 0.0007638 -0.0167053 -0.0265605 -0.0437636 -0.0388584 -0.0074527 0.0226316 0.0908371 -0.0059429 0.0695385 -0.0271627 0.0916331 0.0767976 0.0027462 0.0361784 -0.0279392 0.0883024 0.0242941 -0.0613713 0.0805181 -0.0571084 0.095196 0.0451866 0.0451943 0.025428 0.0645446 0.2316413 -0.0765562 0.0831476 -0.1316906 0.3134154 0.11456 0.0817334 0.1097324 0.280975 unknown
polarizability: 88.3929242|0.5154933|78.9218075|-0.2618891|-0.7453592|70.7106974 unknown
InChI: InChI=1S/C7H16NO/c1-8(2)5-3-4-7(9)6-8/h7,9H,3-6H2,1-2H3
charge 1 multiplicity 1
25 atoms
O  2.455659 -1.271794 0.182849
N  -1.143382 -0.24466 0.010451
C  0.148948 -1.042918 0.267683
C  -0.955294 1.220626 0.486064
C  1.411388 -0.383212 -0.324873
C  0.284723 1.888068 -0.126062
C  1.566542 1.070367 0.162875
C  -2.274505 -0.882225 0.817285
C  -1.522575 -0.290318 -1.468384
H  0.011575 -2.056598 -0.143384
H  0.278916 -1.117372 1.361534
H  -0.862575 1.168275 1.585462
H  -1.886609 1.755679 0.233183
H  1.382612 -0.410506 -1.436108
H  0.370092 2.893262 0.324398
H  0.153234 2.054102 -1.211631
H  2.435218 1.547459 -0.32533
H  1.773226 1.052348 1.250452
H  -2.401832 -1.927597 0.496296
H  -2.016757 -0.851707 1.886685
H  -3.205085 -0.320925 0.640616
H  -1.655802 -1.341459 -1.766875
H  -2.464466 0.261186 -1.611677
H  -0.730509 0.165811 -2.076099
H  3.332258 -1.054293 -0.22251
