program: Gaussian 09
title: 000193921
version: EM64L-G09RevD.01
frameworkgroup: C1[X(C8H14N2O4)]
method: RPBEPBE
basis: SDD
operation: Freq
keyword: #p
keyword: freq=noraman
keyword: PBEPBE/SDD
title: #p freq=noraman PBEPBE/SDD
converged: YES YES NO NO
title: Mulliken charges:
elementType: O O O O N N C C C C C C C C H H H H H H H H H H H H H H
charge: -0.452974 -0.430810 -0.300110 -0.259866 -0.375374 -0.357091 -0.160877 -0.193762 -0.055611 -0.069355 0.163658 0.139542 -0.723519 -0.726951 0.291054 0.253679 0.215354 0.272847 0.338246 0.331720 0.260208 0.193816 0.231076 0.206708 0.258144 0.229365 0.372216 0.348665
chargesum: 0.00000
title: Mulliken charges with hydrogens summed into heavy atoms:
elementType: O O O O N N C C C C C C C C
charge: -0.080758 -0.082145 -0.300110 -0.259866 -0.037127 -0.025371 0.130177 0.059918 0.159743 0.203492 0.163658 0.139542 -0.038419 -0.032734
polarizability: 1.39448916e+02 -6.93374962e+00 1.12912220e+02 8.59650864e+00 3.59479044e-01 8.13571166e+01
1716.lowfreq: -0.0004 0.0001 0.0008 7.6431 8.9462 17.6119 37.1597 68.6507 74.0609
frequency: 37.0101 68.6414 74.0293 85.9307 124.3548 148.5812 183.4441 222.0998 233.2668 267.5614 277.7296 308.9318 324.9598 339.4771 363.6046 410.3693 414.9248 446.7880 466.2073 488.1403 519.8315 598.6876 622.8553 655.3062 685.5993 701.9770 720.2218 794.8275 814.1066 829.7437 861.9568 884.1280 920.7590 964.0659 1001.9259 1045.2128 1068.7689 1075.6690 1089.4583 1094.1694 1110.5869 1145.9803 1233.2688 1236.4099 1259.5882 1272.6558 1283.6631 1288.6417 1313.0260 1324.5547 1359.6125 1371.8123 1382.6877 1391.2546 1392.0264 1408.2822 1419.4877 1433.7959 1463.8471 1467.3651 1477.3408 1484.3344 1609.5308 1639.1724 2944.6393 2970.1640 2972.3748 2986.8676 3041.9526 3054.9849 3077.3794 3081.9479 3095.4061 3102.2735 3354.9213 3505.8746 3521.6338 3546.9985
redmass: 5.2673 4.8014 3.7483 5.6141 5.5657 4.7864 2.3568 1.4071 1.1292 3.4357 3.2251 3.1237 1.5167 3.2756 3.6240 3.3888 4.4358 9.2307 3.7437 3.3078 3.4091 2.4481 2.0818 3.7276 1.1141 1.9181 1.8967 4.1110 5.5980 3.6123 2.3846 2.5219 2.3228 3.0029 1.5743 1.9779 2.6005 2.0674 2.3897 2.1446 2.2246 2.3176 1.2682 1.4217 1.5633 1.4211 1.3765 1.2838 1.1948 1.6022 1.6766 1.3253 1.5281 1.8799 1.2801 1.7130 1.6107 2.6628 1.0765 1.0498 1.0498 1.0498 5.1061 6.2822 1.0829 1.0830 1.0394 1.0374 1.0851 1.0908 1.0924 1.0998 1.0990 1.0982 1.0650 1.0761 1.0756 1.0659
irintensity: 1.4125 1.0449 0.8040 8.2466 3.6443 1.5085 0.6291 1.5656 9.4413 1.3435 2.1945 64.1403 128.9930 18.3911 4.0242 18.9009 26.3649 1.6510 12.8111 11.2948 10.4236 44.6834 37.5999 14.7150 122.2622 4.6690 256.9801 15.9679 20.3040 6.5864 5.6685 8.1008 10.3338 1.8156 15.7608 64.7823 22.8474 36.2054 43.6392 46.1744 24.9633 0.7313 33.1715 24.6472 30.2569 33.9336 59.4208 14.9970 5.3779 38.7506 2.9161 4.8286 172.6846 180.0373 4.0166 54.5736 10.1231 7.4772 5.0588 12.7239 9.1344 12.4707 253.3076 374.1152 31.2079 26.9958 17.6626 17.9641 8.9524 3.5198 33.4470 34.5196 17.2510 18.5836 134.3730 22.0102 28.5347 6.3256
temp: 298.150 k
press: 1.00000 atm
elementType: 8 8 8 8 7 7 6 6 6 6 6 6 6 6 1 1 1 1 1 1 1 1 1 1 1 1 1 1
symmnumber: 1
zpe: 593716.6 jmol-1
zpe.correction: 0.226135 hartree
zpe.thermalcorrener: 0.240736 hartree
zpe.thermalcorrenthalpy: 0.241681 hartree
zpe.thermalcorrgfe: 0.184725 hartree
zpe.sumelectzpe: -722.566059 hartree
zpe.sumelectthermal: -722.551457 hartree
zpe.sumelectthermalent: -722.550513 hartree
zpe.sumelectthermalfe: -722.607468 hartree
dipole: -2.9935 -1.3402 -1.2476
dipole: 3.5091
quadrupole: -82.8579 -94.8056 -85.3465
quadrupole: 18.9999 1.5269 1.3998
quadrupole: 4.8121 -7.1356 2.3235 18.9999 1.5269 1.3998
hfenergy: -722.7921936 hartree
pointgroup: C01 [X(C8H14N2O4)]
dipole: 1.0963954 -0.66307 0.5141044 debye
polarizability: 137.7149574|3.5847149|111.7756145|14.9712727|3.9296353|84.2276804 unknown
InChI: InChI=1S/C8H14N2O4/c1-3(11)5-7(13)10-6(4(2)12)8(14)9-5/h3-6,9-12H,1-2H3
charge 0 multiplicity 1
28 atoms
O  -3.346147 -0.887079 -0.572335
O  1.882756 -0.208963 -1.233753
O  -1.298731 -2.255991 0.574162
O  1.341948 2.462407 1.392142
N  -0.524648 1.319415 0.600255
N  0.595904 -1.109665 1.232405
C  -1.181546 0.137252 0.013537
C  1.510287 0.043898 1.208948
C  -2.739058 0.191948 0.202326
C  2.57297 -0.071365 0.059826
C  -0.632708 -1.167003 0.619033
C  0.764686 1.380699 1.075428
C  -3.356118 1.49546 -0.319499
C  3.584107 -1.20479 0.289321
H  -1.002145 0.09393 -1.082014
H  2.051309 0.096567 2.170996
H  -2.958686 0.076165 1.287034
H  3.088062 0.901944 -0.001427
H  -0.982989 2.224054 0.458879
H  0.909928 -1.982082 1.669753
H  -4.453001 1.383057 -0.314946
H  -3.109095 2.368024 0.312779
H  -3.041683 1.689966 -1.360884
H  3.085692 -2.193015 0.348325
H  4.303182 -1.238568 -0.546814
H  4.153222 -1.049331 1.223873
H  -2.905014 -1.734848 -0.267558
H  1.629019 -1.159387 -1.360891
