program: Gaussian 09
title: 000193913
version: EM64L-G09RevD.01
frameworkgroup: C1[X(C11H20N2O2)]
method: RPBEPBE
basis: SDD
operation: Freq
keyword: #p
keyword: freq=noraman
keyword: PBEPBE/SDD
title: #p freq=noraman PBEPBE/SDD
converged: YES YES NO NO
title: Mulliken charges:
elementType: O O N N C C C C C C C C C C C H H H H H H H H H H H H H H H H H H H H
charge: -0.338093 -0.285315 -0.167000 -0.364030 -0.221239 -0.487413 -0.352350 -0.501889 0.194139 0.226996 0.229086 -0.733199 -0.695037 -0.707112 -0.619108 0.297505 0.218501 0.267060 0.243974 0.217496 0.267686 0.226201 0.228938 0.226357 0.223429 0.217816 0.246079 0.194900 0.233562 0.221077 0.208956 0.366537 0.266228 0.226380 0.222883
chargesum: 0.00000
title: Mulliken charges with hydrogens summed into heavy atoms:
elementType: O O N N C C C C C C C C C C C
charge: -0.338093 -0.285315 -0.167000 0.002507 0.076266 -0.001851 0.109121 -0.008002 0.194139 0.226996 0.229086 -0.054475 -0.036243 -0.043518 0.096383
polarizability: 1.51618404e+02 5.23280739e+00 1.47491497e+02 1.25870199e+00 3.53934967e+00 1.08908916e+02
1716.lowfreq: 0.0010 0.0011 0.0013 3.8128 8.2518 12.6290 38.0191 54.2733 68.8213
frequency: 37.7410 54.2042 68.8010 97.5612 105.1595 136.6085 149.2741 166.9306 196.8966 212.2362 221.9914 224.7825 238.0527 259.9413 289.6644 300.5610 335.9088 344.5827 368.7965 383.8838 411.0810 444.2031 527.2478 575.9714 596.2053 647.7397 700.8510 722.6216 782.8837 823.2178 841.1760 858.8784 867.6273 905.6118 925.9564 927.0869 933.7253 936.0652 954.0330 995.5403 1021.9212 1027.8667 1045.8199 1080.6294 1103.4584 1118.4458 1125.9778 1148.3876 1168.9013 1181.2114 1206.2744 1219.4877 1221.4362 1238.5539 1240.9635 1288.0580 1308.0963 1321.3748 1324.5600 1331.9817 1363.2357 1377.7602 1381.2456 1410.3884 1414.9431 1449.5570 1453.1427 1462.4352 1466.7632 1469.9487 1474.3874 1478.0319 1482.7674 1484.9284 1492.0913 1502.7945 1508.9180 1556.1099 1628.2715 2976.2075 2979.7824 2985.2589 2990.6003 2991.8403 3014.2700 3029.0279 3036.3507 3053.7598 3067.0797 3073.4693 3075.4910 3083.3230 3084.9591 3095.0428 3098.8077 3105.8403 3109.8458 3113.0717 3296.8670
redmass: 2.8361 4.4415 4.9017 1.4204 1.6859 3.5751 2.2918 2.1736 3.6741 1.4205 2.2333 1.4166 2.9236 1.1585 2.3779 2.2686 3.7870 4.1465 3.0997 2.5785 3.0886 4.4192 3.5702 2.6995 4.0703 3.7400 4.3194 5.9374 4.1831 2.2968 3.9816 1.7148 1.2210 1.6841 2.5754 2.0838 1.8291 1.9375 1.2371 2.1872 1.4222 1.3978 3.1581 1.5331 1.8857 1.3660 3.6893 1.6892 1.2587 1.7752 2.7750 3.0366 2.4787 1.4342 1.6094 1.6853 1.3490 1.4321 1.3978 1.4152 3.1878 1.3642 1.1898 1.3158 1.1777 1.0966 1.0511 1.1274 1.0494 1.1098 1.0756 1.0740 1.0925 1.0470 1.2862 1.0749 2.4493 1.6683 5.7200 1.0349 1.0347 1.0365 1.0400 1.0590 1.0668 1.0617 1.0836 1.1014 1.1000 1.0995 1.0995 1.1002 1.0991 1.1027 1.0984 1.0988 1.1024 1.0987 1.0834
irintensity: 0.2532 1.3656 6.9165 1.4006 3.1722 5.4397 0.4229 2.7330 1.5456 0.5706 1.4297 0.4675 1.7799 0.8164 1.3457 4.0280 5.0415 22.5851 7.0046 3.3482 2.5628 14.7100 7.6386 5.3741 1.8537 3.7986 1.3224 9.7499 2.2577 28.7356 14.4512 31.4442 99.0138 8.0484 11.0969 1.3768 1.2380 3.6556 0.6088 3.0332 0.2248 0.7402 7.6593 6.5262 5.2663 1.0726 26.0418 40.7654 10.4695 8.5974 4.7345 9.4372 53.7639 5.9861 2.7824 8.4621 3.3824 10.4870 2.2211 9.0922 91.0087 15.0773 31.7602 61.9435 25.0648 18.9688 1.7131 12.5142 0.3904 53.7437 31.9153 0.7783 2.1155 12.4731 75.2066 26.8055 182.1741 93.9714 225.4965 76.6076 27.4000 17.1979 21.4527 60.6665 22.1559 33.2912 16.6297 37.8117 14.8290 9.3857 31.9358 21.7691 60.9629 33.3009 30.4033 5.8476 14.6004 21.4760 262.8671
temp: 298.150 k
press: 1.00000 atm
elementType: 8 8 7 7 6 6 6 6 6 6 6 6 6 6 6 1 1 1 1 1 1 1 1 1 1 1 1 1 1 1 1 1 1 1 1
symmnumber: 1
zpe: 792007.5 jmol-1
zpe.correction: 0.301660 hartree
zpe.thermalcorrener: 0.318387 hartree
zpe.thermalcorrenthalpy: 0.319332 hartree
zpe.thermalcorrgfe: 0.257851 hartree
zpe.sumelectzpe: -689.955071 hartree
zpe.sumelectthermal: -689.938343 hartree
zpe.sumelectthermalent: -689.937399 hartree
zpe.sumelectthermalfe: -689.998880 hartree
dipole: -3.2577 1.3891 0.4251
dipole: 3.5670
quadrupole: -99.1665 -85.7955 -91.8466
quadrupole: -6.6424 -5.1091 -3.6086
quadrupole: -6.8969 6.4740 0.4229 -6.6424 -5.1091 -3.6086
hfenergy: -690.2567308 hartree
pointgroup: C01 [X(C11H20N2O2)]
dipole: -1.3243679 -0.3701893 -0.2800291 debye
polarizability: 150.5108727|-5.6944949|146.3965608|-0.3400112|9.7396149|111.1113832 unknown
InChI: InChI=1S/C11H20N2O2/c1-11(2,3)10(15)13-7-5-6-8(13)9(14)12-4/h8,12H,5-7H2,1-4H3
charge 0 multiplicity 1
35 atoms
O  -0.33947 1.240402 1.204296
O  3.388447 -0.584348 -0.555394
N  -0.026588 -0.684201 -0.008893
N  2.337966 1.2751 0.405051
C  1.274618 -0.918106 0.710784
C  1.518145 -2.425434 0.523242
C  -0.301847 -1.78522 -0.98218
C  0.943069 -2.704022 -0.885835
C  -2.28364 0.547543 -0.138653
C  -0.815438 0.387953 0.36371
C  2.439236 -0.064465 0.11478
C  -2.44477 0.409057 -1.681004
C  -2.76786 1.965834 0.266962
C  -3.166395 -0.506821 0.597342
C  3.314481 2.259391 -0.069173
H  1.132487 -0.61979 1.764949
H  0.972038 -2.994806 1.297465
H  2.591332 -2.663552 0.579634
H  -0.426566 -1.38596 -2.001838
H  -1.22594 -2.324786 -0.702074
H  1.692889 -2.411673 -1.639821
H  0.678349 -3.762828 -1.044524
H  -2.402025 -0.63548 -2.02866
H  -1.677489 0.992782 -2.222174
H  -3.434011 0.80868 -1.970378
H  -2.201229 2.747577 -0.269176
H  -2.628963 2.139517 1.345546
H  -3.839272 2.072132 0.014352
H  -3.094945 -0.377411 1.692201
H  -4.224019 -0.37146 0.304334
H  -2.879802 -1.545486 0.352907
H  1.475025 1.568824 0.89856
H  4.117053 1.719784 -0.59751
H  3.753079 2.819562 0.777095
H  2.850253 2.98251 -0.766223
