program: Gaussian 09
title: 000193893
version: EM64L-G09RevD.01
frameworkgroup: C1[X(C13H30NO4P)]
method: RPBEPBE
basis: SDD
operation: Freq
keyword: #p
keyword: freq=noraman
keyword: PBEPBE/SDD
title: #p freq=noraman PBEPBE/SDD
converged: YES YES NO NO
title: Mulliken charges:
elementType: P O O O O N C C C C C C C C C C C C C H H H H H H H H H H H H H H H H H H H H H H H H H H H H H H
charge: 1.333569 -0.473734 -0.568322 -0.754370 -0.652561 -0.113148 -0.352055 -0.556264 -0.559253 -0.583552 -0.301323 -0.371430 -0.346873 -0.368027 -0.391979 -0.352574 -0.255591 -0.354851 -0.695455 0.345152 0.222505 0.270398 0.245764 0.247867 0.244784 0.305413 0.237612 0.367090 0.258359 0.209939 0.232302 0.192595 0.186071 0.190333 0.177987 0.194549 0.194483 0.171727 0.191259 0.202636 0.184830 0.191709 0.212692 0.219163 0.197788 0.187527 0.208096 0.212440 0.214722
chargesum: 0.00000
title: Mulliken charges with hydrogens summed into heavy atoms:
elementType: P O O O O N C C C C C C C C C C C C C
charge: 1.333569 -0.473734 -0.568322 -0.754370 -0.652561 -0.113148 0.215602 0.207764 0.228556 0.251836 0.123575 0.004975 0.025664 -0.001817 0.001916 0.023965 0.176264 0.030464 -0.060197
polarizability: 2.03078989e+02 5.61715803e+00 2.02693106e+02 -1.77397306e+00 -1.29140295e-01 1.56383219e+02
1716.lowfreq: -5.9387 -0.0016 0.0009 0.0014 5.6858 9.0863 13.3864 16.4822 28.9723
frequency: 11.8310 15.6803 28.7384 39.7649 47.7125 56.7281 63.4258 81.2215 98.0736 112.9147 132.6482 136.1382 142.6278 159.8441 182.2180 197.0469 208.8958 220.1374 226.5846 231.1226 263.4216 281.9058 286.1344 292.0381 308.1268 330.5613 337.5257 351.8136 370.3980 376.6572 414.8097 421.3030 435.1727 457.4785 476.4054 497.1189 505.6570 539.1153 621.4914 701.8394 719.2568 727.4417 755.3703 810.8861 823.3604 857.1469 866.0252 869.4958 879.4530 892.7754 921.3361 933.0902 957.4314 991.8700 995.6940 1000.1919 1013.0918 1027.8146 1048.8656 1051.7927 1055.7534 1065.7845 1076.7875 1080.2352 1088.8089 1113.0273 1120.8305 1125.7709 1139.1194 1189.4968 1199.7372 1201.8885 1220.3572 1228.3711 1239.2390 1241.9274 1256.1271 1268.9215 1275.9744 1277.8169 1289.1574 1292.0647 1313.3966 1318.0851 1341.6595 1345.4683 1352.2666 1358.2128 1363.4759 1388.6953 1389.7656 1408.3700 1423.3542 1424.5432 1438.4202 1447.3937 1455.7786 1460.5324 1461.0995 1466.8014 1467.5448 1470.8874 1474.5859 1474.9386 1477.2347 1477.3133 1482.7467 1484.8810 1488.5701 1489.4078 1512.4765 2903.1223 2943.7735 2949.9236 2954.4029 2956.2341 2959.9717 2964.4793 2967.9475 2971.4681 2979.1924 2981.6681 2981.9435 2991.7548 3002.4698 3013.7054 3016.4451 3016.6744 3030.2340 3038.3376 3046.5202 3047.0480 3068.0490 3069.9152 3072.4587 3077.1955 3126.0655 3131.1107 3136.8021 3142.6508 3143.3567
redmass: 4.3788 4.0639 3.8115 1.8642 3.1115 2.4401 4.1592 2.4527 2.3057 2.8908 2.4598 2.9681 2.5961 5.0148 3.9709 2.5224 3.0233 1.4279 2.7152 1.1144 3.6186 1.5536 1.3574 3.4458 1.5254 3.1868 3.5913 4.8095 2.6808 2.8476 4.5073 3.6296 2.4000 2.8490 2.8969 3.6919 3.3190 8.3795 4.4673 3.2519 1.0666 1.1098 1.2214 1.3514 2.1326 4.1780 5.2905 1.7674 2.0218 1.8970 2.7835 1.5594 2.9543 2.6703 3.3942 1.4611 3.3360 3.6656 1.2678 1.4971 2.1767 2.7433 6.7535 2.1120 2.1228 1.4203 2.4918 1.4665 1.8066 1.6675 1.4860 1.2460 1.6936 1.3491 1.2780 1.2472 1.6730 1.2630 1.1670 1.0803 1.0938 1.1243 1.3543 1.2782 1.1850 1.4904 1.7191 1.6294 1.2992 1.2172 1.1489 1.1038 1.1421 1.1269 1.0712 1.0822 1.1117 1.0710 1.0774 1.0851 1.0908 1.0493 1.0725 1.0590 1.0454 1.0700 1.0841 1.0711 1.0845 1.0586 1.0528 1.0559 1.0599 1.0590 1.0594 1.0658 1.0593 1.0601 1.0594 1.0362 1.0595 1.0603 1.0941 1.0983 1.1002 1.0318 1.1021 1.0326 1.1040 1.1056 1.1044 1.0981 1.1005 1.0994 1.0959 1.0950 1.1046 1.1039 1.1036 1.1052 1.1029
irintensity: 5.7999 3.1721 1.8969 0.2893 2.4965 0.4699 2.1067 1.1247 2.1666 3.9767 4.8679 1.7099 0.1921 3.9582 9.5669 1.3238 0.0892 3.2164 1.7215 0.0069 1.0623 4.2826 3.5832 3.7681 3.5293 8.3824 1.8563 12.2096 6.3304 4.2347 23.3280 11.1573 8.9081 0.7116 13.6213 30.6496 22.0393 157.4262 116.6576 5.5111 10.7748 2.9311 5.0139 9.8223 12.4027 50.3949 124.5795 0.3810 72.1682 10.1149 30.6528 48.7173 45.9119 38.4918 26.5986 1.9688 2.5340 14.4325 4.2381 16.8519 29.7120 27.2507 177.4925 6.4754 8.7523 0.6217 10.6974 3.0730 8.5945 0.1059 4.1893 7.1873 1.8211 1.7754 0.1827 3.5099 1.0325 0.3621 2.9005 0.1732 2.3727 0.0563 0.1348 2.3452 3.2061 0.4264 0.9620 0.6247 16.0919 11.2282 9.5966 28.0136 5.6145 15.2236 2.6696 5.8913 22.9180 0.6800 0.6489 8.0474 27.4857 1.2810 3.2371 3.1336 11.7526 6.4369 11.0498 51.3243 8.3272 47.6156 88.4245 165.0527 5.6056 1.2904 7.7088 77.8282 7.9939 62.4696 127.2046 40.7383 76.3371 62.5892 3.6277 2.3434 1.1156 5.8008 1.5603 27.9754 12.6788 116.7374 99.3032 51.6114 93.6655 53.4801 14.6641 4.0617 1.5285 18.8513 1.4475 7.8343 11.3309
temp: 298.150 k
press: 1.00000 atm
elementType: 15 8 8 8 8 7 6 6 6 6 6 6 6 6 6 6 6 6 6 1 1 1 1 1 1 1 1 1 1 1 1 1 1 1 1 1 1 1 1 1 1 1 1 1 1 1 1 1 1
symmnumber: 1
zpe: 1118476.9 jmol-1
zpe.correction: 0.426005 hartree
zpe.thermalcorrener: 0.450958 hartree
zpe.thermalcorrenthalpy: 0.451902 hartree
zpe.thermalcorrgfe: 0.368130 hartree
zpe.sumelectzpe: -1208.589784 hartree
zpe.sumelectthermal: -1208.564832 hartree
zpe.sumelectthermalent: -1208.563887 hartree
zpe.sumelectthermalfe: -1208.647659 hartree
dipole: 5.2956 13.5896 -2.1297
dipole: 14.7396
quadrupole: -153.8006 -108.8428 -129.5781
quadrupole: -41.6322 6.1345 3.2526
quadrupole: -23.0601 21.8977 1.1624 -41.6322 6.1345 3.2526
hfenergy: -1209.0157898 hartree
pointgroup: C01 [X(C13H30N1O4P1)]
dipole: 2.6303476 -4.6159921 2.3243339 debye
polarizability: 203.5535598|-3.5465279|198.4377061|7.8984337|-10.8786724|160.1640487 unknown
InChI: InChI=1S/C13H30NO4P/c1-5-6-7-8-9-10-12-17-19(15,16)18-13-11-14(2,3)4/h5-13H2,1-4H3
charge 0 multiplicity 1
49 atoms
P  -3.098764 0.646595 -1.174017
O  -2.226397 -0.476587 -2.322013
O  -1.676437 1.157778 -0.220613
O  -3.933656 -0.309611 -0.161463
O  -3.691495 1.832289 -2.052627
N  -1.961307 -2.932317 0.46232
C  -2.339444 -2.586198 -1.01083
C  -0.662772 -3.718365 0.488595
C  -3.099214 -3.779486 1.019309
C  -1.837986 -1.683529 1.349817
C  -1.43428 -1.533506 -1.711534
C  2.724125 1.552035 0.161954
C  1.328872 1.481028 -0.497122
C  3.719943 0.518655 -0.412351
C  0.32831 2.513732 0.065525
C  5.119088 0.576054 0.241269
C  -1.056715 2.451606 -0.58918
C  6.111861 -0.452496 -0.347597
C  7.5055 -0.396062 0.314708
H  -3.358676 -2.161342 -0.955497
H  -2.336431 -3.558884 -1.535522
H  0.128698 -3.11121 0.024385
H  -0.791562 -4.656245 -0.075264
H  -0.392957 -3.94058 1.533238
H  -3.267385 -4.643897 0.357749
H  -4.000563 -3.149164 1.053514
H  -2.836293 -4.12318 2.032486
H  -2.73689 -1.057507 1.167504
H  -0.95603 -1.097132 1.05592
H  -1.743855 -2.026844 2.393485
H  -0.884561 -1.999543 -2.547631
H  -0.689851 -1.102187 -1.00834
H  2.623696 1.399108 1.257384
H  3.140966 2.572552 0.03015
H  0.905655 0.464779 -0.361445
H  1.430078 1.63117 -1.592221
H  3.820281 0.678793 -1.506265
H  3.300601 -0.503087 -0.287494
H  0.730008 3.537929 -0.084663
H  0.21307 2.373186 1.158921
H  5.022718 0.408044 1.334703
H  5.537723 1.597114 0.121248
H  -0.982369 2.536051 -1.691793
H  -1.705459 3.272424 -0.228403
H  6.211646 -0.277265 -1.438304
H  5.689072 -1.47249 -0.235135
H  7.4366 -0.598184 1.400471
H  7.962881 0.60359 0.189801
H  8.195359 -1.139916 -0.125031
