program: Gaussian 09
title: 000193886
version: EM64L-G09RevD.01
frameworkgroup: C1[X(C6H13O9P)]
method: RPBEPBE
basis: SDD
operation: Freq
keyword: #p
keyword: freq=noraman
keyword: PBEPBE/SDD
title: #p freq=noraman PBEPBE/SDD
converged: YES YES NO NO
title: Mulliken charges:
elementType: P O O O O O O O O O C C C C C C H H H H H H H H H H H H H
charge: 1.397631 -0.483769 -0.466621 -0.575747 -0.439194 -0.245600 -0.458615 -0.680282 -0.668392 -0.577206 -0.100947 -0.167982 -0.288789 0.213424 -0.180783 -0.387302 0.233476 0.283704 0.264030 0.271138 0.284498 0.247166 0.212967 0.387353 0.380838 0.363566 0.372993 0.408508 0.399937
chargesum: 0.00000
title: Mulliken charges with hydrogens summed into heavy atoms:
elementType: P O O O O O O O O O C C C C C C
charge: 1.397631 -0.096416 -0.085783 -0.575747 -0.075627 -0.245600 -0.085621 -0.271774 -0.268455 -0.577206 0.132529 0.115722 0.246379 0.213424 0.103715 0.072831
polarizability: 1.47325820e+02 3.11083043e-01 1.11816349e+02 4.36560390e+00 2.36025534e+00 9.76499488e+01
1716.lowfreq: -7.7197 -2.9575 -0.0009 -0.0006 0.0012 4.0570 17.3292 28.3797 30.3604
frequency: 16.9574 28.2978 30.3415 47.8026 69.5774 89.1435 98.3996 120.3029 150.9176 163.1922 171.5246 201.7690 209.6520 237.7710 242.5490 253.3113 293.7445 308.0451 321.3138 335.6481 350.3945 378.2255 390.8290 414.7413 464.8447 479.9023 518.7773 536.6632 558.2582 585.4004 639.2021 669.5753 686.2275 730.5155 761.6158 793.7107 810.5845 835.4313 861.2300 909.4130 934.9732 946.6635 1003.5717 1009.1063 1014.0632 1015.3220 1032.5058 1064.3561 1077.7923 1093.8366 1126.6174 1163.2354 1178.8791 1203.7816 1222.8504 1227.9790 1281.7074 1310.2610 1324.1964 1328.9605 1332.0988 1376.9578 1381.6238 1387.8990 1400.6757 1455.4359 1470.4986 1600.6619 2943.9826 3000.5316 3014.5950 3033.8557 3093.3548 3100.9741 3117.8640 3407.9334 3474.0759 3504.9713 3533.1061 3591.5121 3613.5147
redmass: 7.0219 6.3432 7.4708 5.4500 8.0837 7.9773 4.3942 5.0764 3.2155 4.0249 3.3891 2.7806 5.3528 5.8098 3.2581 4.2033 2.7715 3.5098 5.6861 5.7478 4.4348 1.7547 5.3745 7.1596 2.2948 1.1770 1.4021 2.2358 1.3033 4.3272 7.3818 1.5079 2.4427 9.6614 5.8723 3.9346 6.1729 3.5469 3.4543 2.6917 3.5023 7.0053 1.3866 3.3571 1.7463 1.3131 3.3656 2.2762 2.5635 5.7611 1.9944 1.1044 1.1285 1.1544 1.3577 1.1468 1.2843 1.2508 1.4474 1.2701 1.3169 1.2747 1.2790 1.5336 1.9114 1.0820 1.0837 9.8093 1.0800 1.0655 1.0852 1.0556 1.0886 1.0976 1.1105 1.0649 1.0651 1.0648 1.0652 1.0662 1.0666
irintensity: 1.7314 1.0639 1.2413 1.5578 3.5743 0.1109 9.1922 1.2132 54.2741 16.1314 25.4129 40.0303 6.5322 7.6236 23.9844 16.9881 18.4266 25.4820 2.0932 54.6922 58.6816 83.5277 34.5374 9.3266 118.1274 117.4877 202.1851 19.5358 53.1034 30.7029 5.5470 335.7520 26.0708 243.4047 178.8785 9.7620 20.5809 21.7682 25.8171 27.1542 32.1973 187.8459 37.5601 88.3087 74.3999 114.7904 55.7664 10.5107 45.3822 162.1418 50.1828 44.0795 24.0154 50.6570 38.7830 24.8935 2.1563 11.5498 25.2909 14.1114 34.2757 59.5924 43.7297 18.1417 15.8857 10.4512 16.0260 82.6254 17.1116 38.5732 30.3806 8.4652 4.5318 18.4388 5.5982 47.3367 43.5932 35.8378 40.9116 72.3815 77.2770
temp: 298.150 k
press: 1.00000 atm
elementType: 15 8 8 8 8 8 8 8 8 8 6 6 6 6 6 6 1 1 1 1 1 1 1 1 1 1 1 1 1
symmnumber: 1
zpe: 551254.7 jmol-1
zpe.correction: 0.209962 hartree
zpe.thermalcorrener: 0.229373 hartree
zpe.thermalcorrenthalpy: 0.230317 hartree
zpe.thermalcorrgfe: 0.159836 hartree
zpe.sumelectzpe: -1253.326972 hartree
zpe.sumelectthermal: -1253.307560 hartree
zpe.sumelectthermalent: -1253.306616 hartree
zpe.sumelectthermalfe: -1253.377098 hartree
dipole: -1.3111 -2.6242 0.9340
dipole: 3.0786
quadrupole: -121.4179 -103.9798 -93.8910
quadrupole: 11.9113 -0.2108 -0.3446
quadrupole: -14.9883 2.4498 12.5385 11.9113 -0.2108 -0.3446
hfenergy: -1253.5369336 hartree
pointgroup: C01 [X(C6H13O9P1)]
dipole: 0.2963682 -0.5643652 -1.0298911 debye
polarizability: 146.336333|-0.7561672|108.4540993|-7.6587114|6.8317141|102.0016852 unknown
InChI: InChI=1S/C6H13O9P/c7-1-3(8)5(10)6(11)4(9)2-15-16(12,13)14/h3-4,6-9,11-13H,1-2H2
charge 0 multiplicity 1
29 atoms
P  3.756266 -0.235121 -1.110462
O  1.255421 1.726023 1.829304
O  -1.085434 2.189859 0.508616
O  2.658526 0.24353 0.101803
O  -3.84638 0.161639 1.870497
O  -1.453179 -1.26715 0.328039
O  -4.209777 -1.905984 0.058059
O  3.124893 0.657774 -2.426685
O  3.279417 -1.821608 -1.615236
O  5.269101 -0.079082 -0.685544
C  0.602516 0.539951 1.249608
C  -0.888224 0.93307 1.240537
C  1.178132 0.25273 -0.142649
C  -1.834301 -0.095719 0.624141
C  -3.306806 0.335256 0.500935
C  -4.100789 -0.538249 -0.484647
H  0.757084 -0.34513 1.896923
H  -1.199346 1.062099 2.301988
H  0.947524 1.055644 -0.862716
H  0.852977 -0.729935 -0.521767
H  -3.3735 1.409005 0.270235
H  -5.136231 -0.170489 -0.559228
H  -3.635755 -0.532974 -1.489955
H  2.231261 1.638385 1.664729
H  -0.401752 2.815552 0.872365
H  -4.160118 -0.789015 1.901431
H  -3.292626 -2.295889 0.029761
H  3.49394 0.440146 -3.318679
H  3.793059 -2.557216 -1.193306
