program: Gaussian 09
title: 000193873
version: EM64L-G09RevD.01
frameworkgroup: C1[X(C13H17NO4)]
method: RPBEPBE
basis: SDD
operation: Freq
keyword: #p
keyword: freq=noraman
keyword: PBEPBE/SDD
title: #p freq=noraman PBEPBE/SDD
converged: YES YES NO NO
title: Mulliken charges:
elementType: O O O O N C C C C C C C C C C C C C H H H H H H H H H H H H H H H H H
charge: -0.286867 -0.291624 -0.263571 -0.205429 -0.097560 -0.358563 -0.289598 -0.614904 -0.616349 0.117588 0.221198 0.294692 -0.318795 -0.358368 -0.235147 -0.199769 0.269183 -0.751158 0.220612 0.233372 0.232126 0.237506 0.229204 0.196849 0.223669 0.222947 0.193766 0.227113 0.277662 0.255761 0.235106 0.236005 0.245879 0.239868 0.277594
chargesum: 0.00000
title: Mulliken charges with hydrogens summed into heavy atoms:
elementType: O O O O N C C C C C C C C C C C C C
charge: -0.286867 -0.291624 -0.263571 -0.205429 -0.097560 0.095421 0.180034 0.034819 0.027477 0.117588 0.221198 0.294692 -0.041133 -0.102607 -0.000041 0.036236 0.269183 0.012183
polarizability: 2.10045937e+02 -1.36931924e+01 1.76756717e+02 6.41789845e+00 -8.22468753e+00 1.05242783e+02
1716.lowfreq: -3.4454 -0.0001 0.0007 0.0010 2.2057 6.5059 16.2508 30.0719 32.8197
frequency: 16.1844 30.0431 32.7599 52.5356 77.7084 85.3616 99.9840 108.1260 115.9152 146.1545 152.3718 200.6483 217.1671 238.4806 249.5843 269.8355 299.2768 315.2759 352.1838 376.0322 405.1668 414.9635 437.6469 453.4855 495.8320 519.0541 532.8937 547.7616 634.9853 653.7062 677.9107 721.2170 753.6894 776.4799 785.9528 805.4514 824.5249 863.3602 888.7045 915.8914 970.9524 987.2916 997.9278 1023.9448 1033.7553 1037.1587 1039.4518 1040.1429 1066.2478 1071.8289 1091.8480 1118.8514 1140.3946 1154.2834 1173.1006 1187.1323 1194.2378 1238.2129 1259.9493 1269.6835 1271.0455 1302.3215 1327.8107 1377.4026 1379.4943 1384.9818 1423.6442 1430.4130 1441.7816 1449.8977 1450.9543 1454.8797 1462.4776 1470.2322 1471.2643 1475.5931 1481.8012 1487.9299 1574.8878 1604.8057 1620.4245 1693.9475 2860.4613 2871.8703 2907.4768 3010.1835 3019.4130 3028.7974 3043.7134 3049.2569 3078.2609 3089.0129 3104.5533 3130.6852 3140.0125 3143.7909 3158.0718 3174.1619 3186.9060
redmass: 4.7803 2.8959 4.7440 4.1907 3.2610 4.6230 3.2625 2.7607 1.2714 6.9547 3.7394 1.8463 1.2052 2.2262 2.3226 4.2384 3.7639 3.8974 2.9110 3.2515 6.6672 2.5897 3.4326 3.5367 4.3007 3.6594 4.9092 4.4732 5.5823 5.7989 4.5603 3.9013 2.7896 3.2874 1.6306 2.1722 2.7009 5.2744 1.5646 7.7009 1.3775 2.1461 1.3406 3.7153 2.6130 1.6948 2.0821 1.7139 2.1019 2.2314 1.3195 1.9606 1.4762 2.9276 1.0844 1.6745 3.0073 3.4828 1.6321 1.6160 2.0174 1.2129 1.3580 1.2461 1.4198 6.9747 1.1411 2.2091 1.1354 1.0604 1.1259 1.0522 1.0522 2.5351 1.0690 1.0560 1.0857 1.0539 6.9117 8.1404 8.1880 10.6628 1.0562 1.0566 1.0689 1.0366 1.0736 1.0744 1.0714 1.0776 1.1006 1.1000 1.0960 1.1080 1.0866 1.1022 1.0918 1.0965 1.0968
irintensity: 0.9852 0.3169 1.1291 0.4101 6.8939 3.7339 0.4565 0.7993 0.0755 0.2767 2.9078 0.2186 0.9661 0.2550 3.0537 3.2305 2.1942 7.9038 18.6237 8.0179 4.3570 5.3050 0.9006 3.8811 10.6861 13.5614 4.4949 3.6197 7.6806 8.5886 30.4057 7.9401 5.8447 1.8982 74.9690 6.6969 1.5577 89.2503 8.5122 22.4430 3.8748 89.8196 0.0227 114.4696 158.5702 1.0040 26.8132 53.9783 26.3243 19.5572 13.8341 64.4823 2.3514 391.2185 21.7028 6.6704 8.8390 275.1344 19.5293 32.2028 5.2324 0.5687 6.7039 80.2005 9.9275 6.6756 2.2683 10.3142 2.0745 19.0565 9.5878 22.7772 16.2237 39.8476 14.5322 31.7737 17.2643 7.5449 21.3046 67.2728 176.4703 166.3840 82.8210 142.9469 69.3751 1.5133 45.8113 42.8195 30.7202 21.5099 32.5757 43.8448 6.9586 14.6489 3.2702 9.9846 15.8400 9.1516 8.1380
temp: 298.150 k
press: 1.00000 atm
elementType: 8 8 8 8 7 6 6 6 6 6 6 6 6 6 6 6 6 6 1 1 1 1 1 1 1 1 1 1 1 1 1 1 1 1 1
symmnumber: 1
zpe: 733761.4 jmol-1
zpe.correction: 0.279475 hartree
zpe.thermalcorrener: 0.298543 hartree
zpe.thermalcorrenthalpy: 0.299487 hartree
zpe.thermalcorrgfe: 0.229601 hartree
zpe.sumelectzpe: -859.854285 hartree
zpe.sumelectthermal: -859.835217 hartree
zpe.sumelectthermalent: -859.834273 hartree
zpe.sumelectthermalfe: -859.904159 hartree
dipole: 0.2486 -0.7507 -0.1969
dipole: 0.8149
quadrupole: -87.7644 -94.1451 -113.0251
quadrupole: -3.7253 -1.1679 -3.9936
quadrupole: 10.5472 4.1664 -14.7136 -3.7253 -1.1679 -3.9936
hfenergy: -860.1337595 hartree
pointgroup: C01 [X(C13H17N1O4)]
dipole: -0.0614765 0.2879765 -0.1268175 debye
polarizability: 205.647685|-18.3455048|181.7656244|-5.1192921|-3.7302078|104.6321286 unknown
InChI: InChI=1S/C13H17NO4/c1-10(15)18-12-7-5-4-6-11(12)13(16)17-9-8-14(2)3/h4-7H,8-9H2,1-3H3
charge 0 multiplicity 1
35 atoms
O  1.147697 1.242872 -0.709832
O  -2.369347 -1.241692 -0.014675
O  0.32928 -0.935286 -0.761291
O  -1.022458 -1.447619 1.899054
N  4.552303 -0.224727 0.047983
C  3.220431 0.353771 0.33651
C  2.512956 0.709537 -0.986135
C  4.500581 -1.666928 -0.272711
C  5.566312 0.078857 1.076847
C  -1.180651 0.939324 -0.269212
C  0.126348 0.294203 -0.588468
C  -2.3535 0.17635 0.00376
C  -1.297006 2.357041 -0.27832
C  -3.592707 0.806251 0.235261
C  -2.531204 2.991481 -0.043331
C  -3.685836 2.212756 0.207569
C  -1.559571 -1.975753 0.912957
C  -1.513013 -3.418648 0.488478
H  3.350242 1.277424 0.928408
H  2.572373 -0.333382 0.930212
H  2.426725 -0.170862 -1.64482
H  3.034762 1.527599 -1.504171
H  3.758665 -1.858443 -1.066438
H  4.225277 -2.298075 0.609187
H  5.487087 -2.000385 -0.641894
H  6.554121 -0.282669 0.737487
H  5.352369 -0.393192 2.068881
H  5.637262 1.170978 1.223979
H  -0.398132 2.943999 -0.48161
H  -4.46604 0.179184 0.437138
H  -2.595276 4.084143 -0.05862
H  -4.65184 2.69647 0.387555
H  -2.497858 -3.757799 0.129554
H  -1.165396 -4.047285 1.321087
H  -0.800357 -3.495092 -0.35238
